nicklaus

Blocco totale del sistema operativo OS X v. 10.7.5 (Freeze)

Recommended Posts

Salve a tutti!

anche io ho questo problema, qualcosa blocca tutto e mi impalla il mac...che tristezza...successo già 2 volte nel giro di 3 giorni.

Attacco anche io il log di etrecheck...spero solo da questo sia desumibile qualcosa:

Hardware Information:	MacBook - model: MacBook4,1	1 2.4 GHz Intel Core 2 Duo CPU: 2 cores	4 GB RAMVideo Information:	GMA X3100 - VRAM: 144 MBSystem Software:	Mac OS X 10.7.5 (11G63) - Uptime: 0 days 0:4Disk Information:	Hitachi HTS542516K9SA00 disk0 : (160,04 GB)		disk0s1 (disk0s1) <not mounted>: 209,7 MB 		Macintosh HD (disk0s2) /: 159,18 GB (32,89 GB free)		Recovery HD (disk0s3) <not mounted>: 650 MB USB Information:	Micron Built-in iSight 	Apple Inc. Bluetooth USB Host Controller 	Apple Computer Apple Internal Keyboard / Trackpad 	Apple Computer, Inc. IR Receiver FireWire Information:Kernel Extensions:	com.delantis.kext.tcpblocknke	Version: 2.2.6	com.bresink.driver.BRESINKx86Monitoring	Version: 9.0Problem System Launch Daemons:	       [failed]	com.apple.crsud.plist	   [not loaded]	ftp-proxy.plistProblem System Launch Agents:	       [failed]	com.apple.mrt.uiagent.plistLaunch Daemons:	       [loaded]	com.adobe.fpsaud.plist	       [loaded]	com.delantis.tcbblocknke_load_kext.plist	   [not loaded]	com.delantis.TCPBlock.plist	       [loaded]	net.sourceforge.MonolingualHelper.plistLaunch Agents:	   [not loaded]	com.adobe.AAM.Updater-1.0.plistUser Launch Agents:	   [not loaded]	com.facebook.videochat.Fabrizio.plist	       [loaded]	com.spotify.webhelper.plistUser Login Items:	iTunesHelper	GrowlHelperApp	Alfred	Dropbox	ClustersHelper	XtraFinder3rd Party Preference Panes:	Clusters	Flash Player	Flip4Mac WMV	Growl	Launchpad-Control	Perian	TCPBlock	Xmarks for SafariInternet Plug-ins:	AdobeExManDetect.plugin	Flash Player.plugin	FlashPlayer-10.6.plugin	Flip4Mac WMV Plugin.plugin	iPhotoPhotocast.plugin	JavaAppletPlugin.plugin	npgtpo3dautoplugin.plugin	OfficeLiveBrowserPlugin.plugin	QuickTime Plugin.plugin	RealPlayer Plugin.plugin	SharePointBrowserPlugin.plugin	Silverlight.plugin	User Internet Plug-ins:	Bad Fonts:	NoneTop Processes by CPU:Top Processes by Memory:

tra l'altro vedo dei "failed" tra i daemon...spero non sia nulla di grave :)

chissà inoltre cosa è disk0s1 (disk0s1) che dice di non essere montato (200 mb circa)

Share this post


Link to post
Share on other sites

Io ho risolto tutto montando un disco SSD al posto del Superdrive che oramai non funzionava più perché difettoso ed ora va come una scheggia e non si impalla più.

Ancora un GRAZIE al grande Faxus per i MILLE suggerimenti che mi aveva dato ....

Share this post


Link to post
Share on other sites

eh vabeh, ma non credo che sia la soluzione a tutto...almeno spero, sennò sono semplicemente fregato :D

Disinstalla TCP Lock.

Crsud è un esecutivo di aggiornamento sicurezza scaduto (lo è su OS X 10.8.3, almeno...), dovrebbe essere normale che non sia abilitato.

Disk0s1 è la partizione EFI del disco interno, normale che non sia montata.

Share this post


Link to post
Share on other sites

Certo che so che è un firewall.

Hai inviato solo una descrizione dei contenuti, non un log.

Su quella base e per analogia della disfunzione, col messaggio che appare, sembra essere quella la causa.

Quindi se posti un log completo saprò essere più preciso, altrimenti non ti resta che provare

Share this post


Link to post
Share on other sites

Ciao Faxus, 


io ho un problema simile, sul mio iMac del 2006 che monta Lion, in pratica mi funziona solo in modalità sicura altrimenti dopo qualche secondo parte a fare l'arcobaleno che ruota e mi tocca spegnere.


Ho provato a seguire la procedura, ho fatto utility disco da dvd di boot di Leopard (Command R non fa niente, Lion l'ho installato con aggiornamento da SnowLeopard).


resettato l'SMC.


ed ora ti posto il risultato dei due comandi :


 


computer-di-stefano-tampieri:~ Steve$ diskutil list

/dev/disk0

   #:                       TYPE NAME                    SIZE       IDENTIFIER

   0:      GUID_partition_scheme                        *250.1 GB   disk0

   1:                        EFI                         209.7 MB   disk0s1

   2:                  Apple_HFS HD                      249.2 GB   disk0s2

   3:                 Apple_Boot Recovery HD             650.0 MB   disk0s3

/dev/disk1

   #:                       TYPE NAME                    SIZE       IDENTIFIER

   0:     FDisk_partition_scheme                        *639.4 GB   disk1

   1:                  Apple_HFS My Passport             639.4 GB   disk1s1

/dev/disk2

   #:                       TYPE NAME                    SIZE       IDENTIFIER

   0:        CD_partition_scheme                        *804.4 MB   disk2

   1:     Apple_partition_scheme                         700.4 MB   disk2s0

   2:        Apple_partition_map                         32.3 KB    disk2s0s1

   3:                  Apple_HFS WD SmartWare            237.5 MB   disk2s0s2

computer-di-stefano-tampieri:~ Steve$ 

computer-di-stefano-tampieri:~ Steve$ kextstat -kl | awk '!/com\.apple/{printf "%s %s\n", $6, $7}'

com.wdc.driver.USBHP (1.0.4)

computer-di-stefano-tampieri:~ Steve$ 

computer-di-stefano-tampieri:~ Steve$ 

 

Share this post


Link to post
Share on other sites

Questo è il report di EtreCheck :


 


Hardware Information:


iMac (20-inch Late 2006)


iMac - model: iMac5,1


1 2.16 GHz Intel Core 2 Duo CPU: 2 cores


3 GB RAM


 


Video Information:


ATY,RadeonX1600 - VRAM: 128 MB


 


Startup Items:


Asterisk - Path: /Library/StartupItems/Asterisk


MediaServer - Path: /Library/StartupItems/MediaServer


MissingSyncListener - Path: /Library/StartupItems/MissingSyncListener


ParallelsDesktopTransporter - Path: /Library/StartupItems/ParallelsDesktopTransporter


Privoxy - Path: /Library/StartupItems/Privoxy


 


System Software:


Mac OS X 10.7.5 (11G63b) - Uptime: 0 days 0:31:0


 


Disk Information:


WDC WD2500JS-40TGB0 disk0 : (250,06 GB)


disk0s1 (disk0s1) <not mounted>: 209,7 MB 


HD (disk0s2) /: 249,2 GB (20,3 GB free)


Recovery HD (disk0s3) <not mounted>: 650 MB 


 


USB Information:


Micron Built-in iSight 


 


Western Digital My Passport 070B 639,43 GB


My Passport (disk1s1) /Volumes/My Passport: 639,43 GB (133,43 GB free)


 


Mitsumi Electric Hub in Apple Extended USB Keyboard 


Mitsumi Electric Apple Extended USB Keyboard 


 


Apple Inc. Bluetooth USB Host Controller 


 


Apple Computer, Inc. IR Receiver 


 


 


 


FireWire Information:


 


Thunderbolt Information:


 


Kernel Extensions:


com.wdc.driver.USBHP (1.0.4)


 


Problem System Launch Daemons:


[not loaded] ftp-proxy.plist


 


Problem System Launch Agents:


 


Launch Daemons:


[not loaded] com.adobe.fpsaud.plist


[not loaded] com.adobe.SwitchBoard.plist


[not loaded] com.barebones.textwrangler.plist


[not loaded] com.google.keystone.daemon.plist


[not loaded] com.parallels.desktop.launchdaemon.plist


[not loaded] com.teamviewer.teamviewer_service.plist


[not loaded] com.zeobit.MacKeeper.AntiVirus.plist


 


Launch Agents:


[not loaded] com.adobe.AAM.Updater-1.0.plist


[not loaded] com.adobe.CS5ServiceManager.plist


[not loaded] com.epson.epw.agent.plist


[not loaded] com.google.keystone.agent.plist


[not loaded] com.parallels.desktop.launch.plist


[not loaded] com.teamviewer.teamviewer.plist


[not loaded] com.teamviewer.teamviewer_desktop.plist


 


User Launch Agents:


[not loaded] com.zeobit.MacKeeper.Helper.plist


 


User Login Items:


TeamViewer


GrowlHelperApp


Skype


MagicMenu


Agente base AirPort


MainMenu


LaCie Network Assistant


Dropbox


CleanMyDrive


Launch Nikon Message Center 2


ConnectService


 


3rd Party Preference Panes:


Connect360


DivX


Flash Player


Flip4Mac WMV


Growl


MacFUSE


Perian


 


Internet Plug-ins:


CANONiMAGEGATEWAYDL.plugin


CANONiMAGEGATEWAYLI.plugin


ContentUploaderPlugin.plugin


DivXBrowserPlugin.plugin


Flash Player.plugin


FlashPlayer-10.6.plugin


Flip4Mac WMV Plugin.plugin


GarminGpsControl.plugin


iPhotoPhotocast.plugin


JavaAppletPlugin.plugin


QuickTime Plugin.plugin


Silverlight.plugin


VLC Plugin.plugin


 


User Internet Plug-ins:


Picasa.plugin


Unity Player.plugin


 


Bad Fonts:


None


 


Top Processes by CPU:


    67% WindowServer


    10% Dock


    1% EtreCheck


    1% Google Chrome


    0% ps


    0% aosnotifyd


 


Top Processes by Memory:


258 MB   Google Chrome


92 MB    Google Chrome Helper


83 MB    Dock


83 MB    Finder


62 MB    WindowServer


61 MB    SystemUIServer


46 MB    coreservicesd


46 MB    EtreCheck


43 MB    DashboardClient


37 MB    com.apple.dock.extra


 


Virtual Memory Statistics


521 MB   Free RAM


1.83 GB  Active RAM


484 MB   Inactive RAM


194 MB   Wired RAM


489 MB   Page-ins


0 B      Page-outs

Share this post


Link to post
Share on other sites

Sep 13 20:59:07 localhost bootlog[0]: BOOT_TIME 1379098747 0


Sep 13 21:01:34 localhost com.apple.kextd[9]: Safe boot mode detected; invalidating system extensions caches.


Sep 13 21:01:34 localhost com.apple.kextd[9]: Cache file /System/Library/Caches/com.apple.kext.caches/Directories/System/Library/Extensions/KextIdentifiers.plist.gz is out of date; not using.


Sep 13 20:59:12 localhost com.apple.launchd[1]: *** launchd[1] has started up. ***


Sep 13 21:01:31 localhost com.apple.launchd[1] (com.apple.powerd): Unknown value for key POSIXSpawnType: Interactive


Sep 13 21:01:31 localhost com.apple.launchd[1] (com.apple.sandboxd): Unknown value for key POSIXSpawnType: Interactive


Sep 13 21:01:50 localhost fseventsd[18]: event logs in /.fseventsd out of sync with volume.  destroying old logs. (668 162 25294)


Sep 13 21:01:50 localhost fseventsd[18]: log dir: /.fseventsd getting new uuid: 5BB4A0ED-1B93-4A51-9800-B2E2C42ABB00


Sep 13 21:01:52 localhost UserEventAgent[10]: starting CaptiveNetworkSupport as SystemEventAgent built Jun 13 2011 17:29:21


Sep 13 21:01:52 localhost UserEventAgent[10]: CaptiveNetworkSupport:CreateInterfaceWatchList:2788 WiFi Devices Found. :)


Sep 13 21:01:52 localhost UserEventAgent[10]: CaptiveNetworkSupport:CaptivePublishState:1211 en1 - PreProbe


Sep 13 21:01:52 localhost UserEventAgent[10]: CaptiveNetworkSupport:CaptiveSCRebuildCache:81 Failed to get service order


Sep 13 21:01:52: --- last message repeated 1 time ---


Sep 13 21:01:52 localhost UserEventAgent[10]: CaptiveNetworkSupport:CaptivePublishState:1211 en1 - PreProbe


Sep 13 21:01:52 localhost UserEventAgent[10]: CaptiveNetworkSupport:CaptiveSCRebuildCache:81 Failed to get service order


Sep 13 21:01:54: --- last message repeated 1 time ---


Sep 13 21:01:54 localhost UserEventAgent[10]: CertsKeychainMonitor: configuring


Sep 13 21:01:55 localhost airportd[28]: _processDLILEvent: en1 attached (down)


Sep 13 21:01:55 localhost UserEventAgent[10]: CaptiveNetworkSupport:CaptiveSCRebuildCache:81 Failed to get service order


Sep 13 21:01:55: --- last message repeated 1 time ---


Sep 13 21:01:55 localhost UserEventAgent[10]: CaptiveNetworkSupport:CaptivePublishState:1211 en1 - PreProbe


Sep 13 21:01:56 computer-di-steve configd[15]: setting hostname to "computer-di-steve.local"


Sep 13 21:01:56 computer-di-steve configd[15]: network configuration changed.


Sep 13 21:01:59 computer-di-steve mDNSResponder[11]: mDNSResponder mDNSResponder-320.16 (Jul 19 2012 21:07:07) starting OSXVers 11


Sep 13 21:02:00 computer-di-steve systemkeychain[41]: done file: /var/run/systemkeychaincheck.done


Sep 13 21:02:00 computer-di-steve configd[15]: network configuration changed.


Sep 13 21:02:01: --- last message repeated 1 time ---


Sep 13 21:02:01 computer-di-steve mDNSResponder[11]: D2D_IPC: Loaded


Sep 13 21:02:01 computer-di-steve mDNSResponder[11]: D2DInitialize succeeded


Sep 13 21:02:01 computer-di-steve com.apple.kextd[9]: Can't read info dictionary for MissingSyncWM.kext: IOCFUnserialize: syntax error near line 1.


Sep 13 21:02:04 computer-di-steve airportd[28]: _doAutoJoin: Already associated to “ESPAPPLEâ€. Bailing on auto-join.


Sep 13 21:02:04 computer-di-steve UserEventAgent[10]: ServermgrdRegistration cannot load config data


Sep 13 21:02:04 computer-di-steve com.apple.kextd[9]: Cache file /System/Library/Caches/com.apple.kext.caches/Startup/IOKitPersonalities_i386.ioplist.gz is out of date; not using.


Sep 13 21:02:07 computer-di-steve com.apple.ucupdate.plist[60]: ucupdate: Checked 1 update, no match found.


Sep 13 21:02:08 computer-di-steve launchdadd[27]: FAILURE: Could not send MIG reply: 0x10000003


Sep 13 21:02:08 computer-di-steve com.apple.pfctl[68]: No ALTQ support in kernel


Sep 13 21:02:08 computer-di-steve com.apple.pfctl[68]: ALTQ related functions disabled


Sep 13 21:02:11 computer-di-steve com.apple.usbmuxd[59]: usbmuxd-296.4 on Dec 21 2012 at 16:11:14, running 64 bit


Sep 13 21:02:21 computer-di-steve stackshot[63]: Timed out waiting for IOKit to finish matching.


Sep 13 21:02:25 computer-di-steve netbiosd[70]: Unable to start NetBIOS name service: 


Sep 13 21:02:25 computer-di-steve com.apple.kextd[9]: Can't load prl_usb_connect.kext - ineligible during safe boot.


Sep 13 21:02:25 computer-di-steve com.apple.kextd[9]: Load com.parallels.kext.prl_usb_connect failed; removing personalities from kernel.


Sep 13 21:02:26 computer-di-steve com.apple.kextd[9]: Can't load AppleMCCSControl.kext - ineligible during safe boot.


Sep 13 21:02:26 computer-di-steve com.apple.kextd[9]: Load com.apple.driver.AppleMCCSControl failed; removing personalities from kernel.


Sep 13 21:02:26 computer-di-steve com.apple.kextd[9]: Can't load AppleSMBusPCI.kext - ineligible during safe boot.


Sep 13 21:02:26 computer-di-steve com.apple.kextd[9]: Load com.apple.driver.AppleSMBusPCI failed; removing personalities from kernel.


Sep 13 21:02:27 computer-di-steve com.apple.kextd[9]: Can't load AppleHDAController.kext - ineligible during safe boot.


Sep 13 21:02:27 computer-di-steve com.apple.kextd[9]: Load com.apple.driver.AppleHDAController failed; removing personalities from kernel.


Sep 13 21:02:27 computer-di-steve com.apple.kextd[9]: Can't load IOFireWireIP.kext - ineligible during safe boot.


Sep 13 21:02:27 computer-di-steve com.apple.kextd[9]: Load com.apple.iokit.IOFireWireIP failed; removing personalities from kernel.


Sep 13 21:02:27 computer-di-steve com.apple.kextd[9]: Can't load AppleSMCPDRC.kext - ineligible during safe boot.


Sep 13 21:02:27 computer-di-steve com.apple.kextd[9]: Load com.apple.driver.AppleSMCPDRC failed; removing personalities from kernel.


Sep 13 21:02:27 computer-di-steve com.apple.kextd[9]: Can't load AudioIPCDriver.kext - ineligible during safe boot.


Sep 13 21:02:27 computer-di-steve com.apple.kextd[9]: Load com.apple.driver.AudioIPCDriver failed; removing personalities from kernel.


Sep 13 21:02:27 computer-di-steve com.apple.kextd[9]: Can't load ATIRadeonX1000.kext - ineligible during safe boot.


Sep 13 21:02:27 computer-di-steve com.apple.kextd[9]: Load com.apple.ATIRadeonX1000 failed; removing personalities from kernel.


Sep 13 21:02:27 computer-di-steve com.apple.kextd[9]: Can't load AudioIPCDriver.kext - ineligible during safe boot.


Sep 13 21:02:27 computer-di-steve com.apple.kextd[9]: Load com.apple.driver.AudioIPCDriver failed; removing personalities from kernel.


Sep 13 21:02:27 computer-di-steve configd[15]: subnet_route: write routing socket failed, Network is unreachable


Sep 13 21:02:27 computer-di-steve com.apple.kextd[9]: Can't load AppleTyMCEDriver.kext - ineligible during safe boot.


Sep 13 21:02:27 computer-di-steve com.apple.kextd[9]: Load com.apple.driver.AppleTyMCEDriver failed; removing personalities from kernel.


Sep 13 21:02:28 computer-di-steve com.apple.kextd[9]: Can't load IOBluetoothSerialManager.kext - ineligible during safe boot.


Sep 13 21:02:28 computer-di-steve com.apple.kextd[9]: Load com.apple.iokit.IOBluetoothSerialManager failed; removing personalities from kernel.


Sep 13 21:02:28 computer-di-steve com.apple.kextd[9]: Can't load AppleUpstreamUserClient.kext - ineligible during safe boot.


Sep 13 21:02:28 computer-di-steve com.apple.kextd[9]: Load com.apple.driver.AppleUpstreamUserClient failed; removing personalities from kernel.


Sep 13 21:02:28 computer-di-steve com.apple.kextd[9]: Can't load IOSurface.kext - ineligible during safe boot.


Sep 13 21:02:28 computer-di-steve com.apple.kextd[9]: Load com.apple.iokit.IOSurface failed; removing personalities from kernel.


Sep 13 21:02:28 computer-di-steve com.apple.kextd[9]: Can't load IOUserEthernet.kext - ineligible during safe boot.


Sep 13 21:02:28 computer-di-steve com.apple.kextd[9]: Load com.apple.iokit.IOUserEthernet failed; removing personalities from kernel.


Sep 13 21:02:28 computer-di-steve com.apple.kextd[9]: Can't load prl_hid_hook.kext - ineligible during safe boot.


Sep 13 21:02:28 computer-di-steve com.apple.kextd[9]: Load com.parallels.kext.prl_hid_hook failed; removing personalities from kernel.


Sep 13 21:02:28 computer-di-steve com.apple.kextd[9]: Can't load prl_hypervisor.kext - ineligible during safe boot.


Sep 13 21:02:28 computer-di-steve com.apple.kextd[9]: Load com.parallels.kext.prl_hypervisor failed; removing personalities from kernel.


Sep 13 21:02:28 computer-di-steve com.apple.kextd[9]: Can't load prl_netbridge.kext - ineligible during safe boot.


Sep 13 21:02:28 computer-di-steve com.apple.kextd[9]: Load com.parallels.kext.prl_netbridge failed; removing personalities from kernel.


Sep 13 21:02:28 computer-di-steve com.apple.kextd[9]: Can't load prl_vnic.kext - ineligible during safe boot.


Sep 13 21:02:28 computer-di-steve com.apple.kextd[9]: Load com.parallels.kext.prl_vnic failed; removing personalities from kernel.


Sep 13 21:02:28 computer-di-steve loginwindow[73]: Login Window Application Started


Sep 13 21:02:28 computer-di-steve com.apple.SystemStarter[61]: Starting Asterisk PBX


Sep 13 21:02:29 computer-di-steve com.apple.SystemStarter[61]: Starting up Missing Sync Listener


Sep 13 21:02:29 computer-di-steve com.apple.SystemStarter[61]: Starting TwonkyMedia


Sep 13 21:02:29 computer-di-steve com.apple.SystemStarter[61]: Starting Privoxy


Sep 13 21:02:29 computer-di-steve configd[15]: network configuration changed.


Sep 13 21:02:29 computer-di-steve UserEventAgent[10]: CaptiveNetworkSupport:CaptivePublishState:1211 en1 - Probe


Sep 13 21:02:29 computer-di-steve UserEventAgent[10]: CaptiveNetworkSupport:CNSPreferencesBuildSSIDLookup:278 ssidLookup:


Sep 13 21:02:29 computer-di-steve UserEventAgent[10]:   <empty>


Sep 13 21:02:29 computer-di-steve UserEventAgent[10]: CaptiveNetworkSupport:CaptiveStartDetect:2343 Bypassing probe on ESPAPPLE because it is protected and not on the exception list


Sep 13 21:02:29 computer-di-steve UserEventAgent[10]: CaptiveNetworkSupport:CaptivePublishState:1211 en1 - Unknown


Sep 13 21:02:29 computer-di-steve configd[15]: network configuration changed.


Sep 13 21:02:31: --- last message repeated 1 time ---


Sep 13 21:02:31 computer-di-steve netbiosd[70]: network address or mask changed for en1


Sep 13 21:02:31 computer-di-steve mds[71]: (Normal) FMW: FMW 0 0


Sep 13 21:02:33 computer-di-steve UserEventAgent[10]: servermgr_certs[10] -[CertsRequestHandler(HelperAdditions) identitiesFromKeychain:]: SecItemCopyMatching (err = -25300)


Sep 13 21:02:36 computer-di-steve ntpd[56]: proto: precision = 1.000 usec


Sep 13 21:02:46 computer-di-steve twonkymedia[111]: Launch of "/usr/local/mediaserver/twonkymedia" failed: the PowerPC architecture is no longer supported.


Sep 13 21:02:46 computer-di-steve privoxy[112]: Launch of "./privoxy" failed: the PowerPC architecture is no longer supported.


Sep 13 21:02:46 computer-di-steve com.apple.SystemStarter[61]: 2013-09-13 21:02:46.033 RosettaNonGrata[111:12803] Launch of "/usr/local/mediaserver/twonkymedia" failed: the PowerPC architecture is no longer supported.


Sep 13 21:02:46 computer-di-steve com.apple.SystemStarter[61]: 2013-09-13 21:02:46.033 RosettaNonGrata[112:12803] Launch of "./privoxy" failed: the PowerPC architecture is no longer supported.


Sep 13 21:02:46 computer-di-steve SystemStarter[61]: MediaServer (99) did not complete successfully


Sep 13 21:02:46 computer-di-steve SystemStarter[61]: Privoxy (100) did not complete successfully


Sep 13 21:02:46 computer-di-steve SystemStarter[61]: The following StartupItems failed to start properly:


Sep 13 21:02:46 computer-di-steve SystemStarter[61]: /Library/StartupItems/MediaServer


Sep 13 21:02:46 computer-di-steve SystemStarter[61]:  - execution of Startup script failed


Sep 13 21:02:46 computer-di-steve SystemStarter[61]: /Library/StartupItems/Privoxy


Sep 13 21:02:46 computer-di-steve SystemStarter[61]:  - execution of Startup script failed


Sep 13 21:02:48 computer-di-steve com.apple.SystemStarter[61]: objc[110]: Class SocketLibAsyncUnixStreamSocket is implemented in both /Library/Frameworks/MissingSyncWM.framework/Versions/A/MissingSyncWM and /Library/Application Support/Missing Sync for Windows Mobile/Missing Sync WM Monitor.app/Contents/SharedSupport/Missing Sync Listener.app/Contents/MacOS/Missing Sync Listener. One of the two will be used. Which one is undefined.


Sep 13 21:02:48 computer-di-steve com.apple.SystemStarter[61]: objc[110]: Class SocketLibAsyncSocket is implemented in both /Library/Frameworks/MissingSyncWM.framework/Versions/A/MissingSyncWM and /Library/Application Support/Missing Sync for Windows Mobile/Missing Sync WM Monitor.app/Contents/SharedSupport/Missing Sync Listener.app/Contents/MacOS/Missing Sync Listener. One of the two will be used. Which one is undefined.


Sep 13 21:02:48 computer-di-steve com.apple.SystemStarter[61]: objc[110]: Class SocketLibSyncSocket is implemented in both /Library/Frameworks/MissingSyncWM.framework/Versions/A/MissingSyncWM and /Library/Application Support/Missing Sync for Windows Mobile/Missing Sync WM Monitor.app/Contents/SharedSupport/Missing Sync Listener.app/Contents/MacOS/Missing Sync Listener. One of the two will be used. Which one is undefined.


Sep 13 21:02:48 computer-di-steve com.apple.SystemStarter[61]: objc[110]: Class SocketLibUnixStreamListener is implemented in both /Library/Frameworks/MissingSyncWM.framework/Versions/A/MissingSyncWM and /Library/Application Support/Missing Sync for Windows Mobile/Missing Sync WM Monitor.app/Contents/SharedSupport/Missing Sync Listener.app/Contents/MacOS/Missing Sync Listener. One of the two will be used. Which one is undefined.


Sep 13 21:02:48 computer-di-steve com.apple.SystemStarter[61]: objc[110]: Class SocketLibTCPListener is implemented in both /Library/Frameworks/MissingSyncWM.framework/Versions/A/MissingSyncWM and /Library/Application Support/Missing Sync for Windows Mobile/Missing Sync WM Monitor.app/Contents/SharedSupport/Missing Sync Listener.app/Contents/MacOS/Missing Sync Listener. One of the two will be used. Which one is undefined.


Sep 13 21:02:48 computer-di-steve com.apple.SystemStarter[61]: objc[110]: Class SocketLibAsyncTCPSocket is implemented in both /Library/Frameworks/MissingSyncWM.framework/Versions/A/MissingSyncWM and /Library/Application Support/Missing Sync for Windows Mobile/Missing Sync WM Monitor.app/Contents/SharedSupport/Missing Sync Listener.app/Contents/MacOS/Missing Sync Listener. One of the two will be used. Which one is undefined.


Sep 13 21:02:49 computer-di-steve com.apple.UserEventAgent-System[10]: SecItemCopyMatching: Impossibile trovare nel portachiavi l’elemento specificato.


Sep 13 21:02:49 computer-di-steve UserEventAgent[10]: servermgr_certs[10] -[CertsRequestHandler(HelperAdditions) identitiesFromKeychain:]: SecItemCopyMatching (err = -25300)


Sep 13 21:02:49 computer-di-steve com.apple.UserEventAgent-System[10]: SecItemCopyMatching: Impossibile trovare nel portachiavi l’elemento specificato.


Sep 13 21:02:49 computer-di-steve UserEventAgent[10]: CertsKeychainMonitor: ready to process keychain & timer events


Sep 13 21:02:50 computer-di-steve Missing Sync Listener[110]: 3891612: (CGSLookupServerRootPort) Untrusted apps are not allowed to connect to or launch Window Server before login.


Sep 13 21:02:50 computer-di-steve Missing Sync Listener[110]: kCGErrorRangeCheck: On-demand launch of the Window Server is allowed for root user only.


Sep 13 21:02:50 computer-di-steve Missing Sync Listener[110]: kCGErrorFailure: Set a breakpoint @ CGErrorBreakpoint() to catch errors as they are logged.


Sep 13 21:02:50 computer-di-steve Missing Sync Listener[110]: CGSLookupServerRootPort: Failed to look up the port for "com.apple.windowserver.active" (1102)


Sep 13 21:02:50 computer-di-steve Missing Sync Listener[110]: kCGErrorRangeCheck: On-demand launch of the Window Server is allowed for root user only.


Sep 13 21:02:50 computer-di-steve Missing Sync Listener[110]: CGSLookupServerRootPort: Failed to look up the port for "com.apple.windowserver.active" (1102)


Sep 13 21:02:51 computer-di-steve XProtectUpdater[57]: Ignoring new signature plist: Not an increase in version


Sep 13 21:02:51 computer-di-steve com.apple.launchd[1] (com.apple.xprotectupdater[57]): Exited with code: 252


Sep 13 21:02:53 computer-di-steve loginwindow[73]: **DMPROXY** Found `/System/Library/CoreServices/DMProxy'.


Sep 13 21:02:55 computer-di-steve Missing Sync Listener[110]: _RegisterApplication(), FAILED TO establish the default connection to the WindowServer, _CGSDefaultConnection() is NULL.


Sep 13 21:02:55 computer-di-steve com.apple.SystemStarter[61]: _RegisterApplication(), FAILED TO establish the default connection to the WindowServer, _CGSDefaultConnection() is NULL.


Sep 13 21:02:58 computer-di-steve airportd[116]: _doAutoJoin: Already associated to “ESPAPPLEâ€. Bailing on auto-join.


Sep 13 21:02:59 computer-di-steve loginwindow[73]: 


O3REQUIRE FAILED: ret == 0


  - file: /SourceCache/BezelServices/BezelServices-232.3/Utilities/Utilities.c


  - line: 91


Sep 13 21:02:59 computer-di-steve loginwindow[73]: Failed to lookup Bezel UI Server port: Bootstrap Unknown Service.


Sep 13 21:02:59 computer-di-steve loginwindow[73]: Login Window Started Security Agent


Sep 13 21:02:59 computer-di-steve com.apple.launchctl.LoginWindow[125]: com.apple.findmymacmessenger: Already loaded


Sep 13 21:03:02 computer-di-steve Missing Sync Listener[110]: WARNING: The sun_len field of a sockaddr_un structure passed to CFSocketSetAddress was not set correctly using the SUN_LEN macro.


Sep 13 21:03:02 computer-di-steve com.apple.SystemStarter[61]: 2013-09-13 21:03:01.975 Missing Sync Listener[110:1ac03] WARNING: The sun_len field of a sockaddr_un structure passed to CFSocketSetAddress was not set correctly using the SUN_LEN macro.


Sep 13 21:03:03 computer-di-steve SecurityAgent[134]: Echo enabled


Sep 13 21:03:08 computer-di-steve WindowServer[115]: kCGErrorFailure: Set a breakpoint @ CGErrorBreakpoint() to catch errors as they are logged.


Sep 13 21:03:11 computer-di-steve warmd[58]: [___bootcachectl_filter_out_sharedio_from_history_block_invoke_0:1683] Unable to open i386 shared cache: 2 No such file or directory


Sep 13 21:03:23 computer-di-steve genatsdb[144]: *GENATSDB* FontObjects generated = 513


Sep 13 21:06:03 computer-di-steve helpd[132]: Could not find access page in directory /Applications/Final Cut Express HD.app/Contents/Resources/English.lproj/Final Cut Express Help


Sep 13 21:06:13: --- last message repeated 1 time ---


Sep 13 21:06:13 computer-di-steve helpd[132]: CFPropertyListCreateFromXMLData(): Old-style plist parser: missing semicolon in dictionary.


Sep 13 21:06:43: --- last message repeated 1 time ---


Sep 13 21:07:06 computer-di-steve com.apple.kextd[9]: Cache file /System/Library/Caches/com.apple.kext.caches/Startup/KextPropertyValues_OSBundleHelper_i386.plist.gz is out of date; not using.


Sep 13 21:07:06 computer-di-steve com.apple.kextd[9]: Rescanning kernel extensions.


Sep 13 21:07:06 computer-di-steve com.apple.kextcache[149]: rebuilding /System/Library/Caches/com.apple.kext.caches/Startup/kernelcache


Sep 13 21:07:06 computer-di-steve com.apple.kextd[9]: Can't load /System/Library/Extensions/prl_usb_connect.kext - ineligible during safe boot.


Sep 13 21:07:06 computer-di-steve com.apple.kextd[9]: Load com.parallels.kext.prl_usb_connect failed; removing personalities from kernel.


Sep 13 21:07:06 computer-di-steve com.apple.kextcache[150]: Can't read info dictionary for MissingSyncWM.kext: IOCFUnserialize: syntax error near line 1.


Sep 13 21:07:07: --- last message repeated 1 time ---


Sep 13 21:07:07 computer-di-steve com.apple.kextd[9]: Can't load /System/Library/Extensions/prl_usb_connect.kext - ineligible during safe boot.


Sep 13 21:07:07 computer-di-steve com.apple.kextd[9]: Load com.parallels.kext.prl_usb_connect failed; removing personalities from kernel.


Sep 13 21:07:07 computer-di-steve com.apple.kextd[9]: Can't load /System/Library/Extensions/AppleTyMCEDriver.kext - ineligible during safe boot.


Sep 13 21:07:07 computer-di-steve com.apple.kextd[9]: Load com.apple.driver.AppleTyMCEDriver failed; removing personalities from kernel.


Sep 13 21:07:07 computer-di-steve com.apple.kextd[9]: Can't load /System/Library/Extensions/AppleSMBusPCI.kext - ineligible during safe boot.


Sep 13 21:07:07 computer-di-steve com.apple.kextd[9]: Load com.apple.driver.AppleSMBusPCI failed; removing personalities from kernel.


Sep 13 21:07:07 computer-di-steve com.apple.kextd[9]: Can't load /System/Library/Extensions/AppleHDA.kext/Contents/PlugIns/AppleHDAController.kext - ineligible during safe boot.


Sep 13 21:07:07 computer-di-steve com.apple.kextd[9]: Load com.apple.driver.AppleHDAController failed; removing personalities from kernel.


Sep 13 21:07:07 computer-di-steve com.apple.kextd[9]: Can't load /System/Library/Extensions/AppleMCCSControl.kext - ineligible during safe boot.


Sep 13 21:07:07 computer-di-steve com.apple.kextd[9]: Load com.apple.driver.AppleMCCSControl failed; removing personalities from kernel.


Sep 13 21:07:07 computer-di-steve com.apple.kextd[9]: Can't load /System/Library/Extensions/ATIRadeonX1000.kext - ineligible during safe boot.


Sep 13 21:07:07 computer-di-steve com.apple.kextd[9]: Load com.apple.ATIRadeonX1000 failed; removing personalities from kernel.


Sep 13 21:07:07 computer-di-steve com.apple.kextd[9]: Can't load /System/Library/Extensions/AudioIPCDriver.kext - ineligible during safe boot.


Sep 13 21:07:07 computer-di-steve com.apple.kextd[9]: Load com.apple.driver.AudioIPCDriver failed; removing personalities from kernel.


Sep 13 21:07:07 computer-di-steve com.apple.kextd[9]: Can't load /System/Library/Extensions/IOFireWireIP.kext - ineligible during safe boot.


Sep 13 21:07:07 computer-di-steve com.apple.kextd[9]: Load com.apple.iokit.IOFireWireIP failed; removing personalities from kernel.


Sep 13 21:07:07 computer-di-steve com.apple.kextd[9]: Can't load /System/Library/Extensions/IOPlatformPluginFamily.kext/Contents/PlugIns/AppleSMCPDRC.kext - ineligible during safe boot.


Sep 13 21:07:07 computer-di-steve com.apple.kextd[9]: Load com.apple.driver.AppleSMCPDRC failed; removing personalities from kernel.


Sep 13 21:07:07 computer-di-steve com.apple.kextd[9]: Can't load /System/Library/Extensions/AudioIPCDriver.kext - ineligible during safe boot.


Sep 13 21:07:07 computer-di-steve com.apple.kextd[9]: Load com.apple.driver.AudioIPCDriver failed; removing personalities from kernel.


Sep 13 21:07:07 computer-di-steve com.apple.kextd[9]: Can't load /System/Library/Extensions/AppleUpstreamUserClient.kext - ineligible during safe boot.


Sep 13 21:07:07 computer-di-steve com.apple.kextd[9]: Load com.apple.driver.AppleUpstreamUserClient failed; removing personalities from kernel.


Sep 13 21:07:07 computer-di-steve com.apple.kextd[9]: Can't load /System/Library/Extensions/IOBluetoothFamily.kext/Contents/PlugIns/IOBluetoothSerialManager.kext - ineligible during safe boot.


Sep 13 21:07:07 computer-di-steve com.apple.kextd[9]: Load com.apple.iokit.IOBluetoothSerialManager failed; removing personalities from kernel.


Sep 13 21:07:07 computer-di-steve com.apple.kextd[9]: Can't load /System/Library/Extensions/IOSurface.kext - ineligible during safe boot.


Sep 13 21:07:07 computer-di-steve com.apple.kextd[9]: Load com.apple.iokit.IOSurface failed; removing personalities from kernel.


Sep 13 21:07:07 computer-di-steve com.apple.kextd[9]: Can't load /System/Library/Extensions/IOUserEthernet.kext - ineligible during safe boot.


Sep 13 21:07:07 computer-di-steve com.apple.kextd[9]: Load com.apple.iokit.IOUserEthernet failed; removing personalities from kernel.


Sep 13 21:07:07 computer-di-steve com.apple.kextd[9]: Can't load /System/Library/Extensions/prl_hid_hook.kext - ineligible during safe boot.


Sep 13 21:07:07 computer-di-steve com.apple.kextd[9]: Load com.parallels.kext.prl_hid_hook failed; removing personalities from kernel.


Sep 13 21:07:07 computer-di-steve com.apple.kextd[9]: Can't load /System/Library/Extensions/prl_hypervisor.kext - ineligible during safe boot.


Sep 13 21:07:07 computer-di-steve com.apple.kextd[9]: Load com.parallels.kext.prl_hypervisor failed; removing personalities from kernel.


Sep 13 21:07:07 computer-di-steve com.apple.kextd[9]: Can't load /System/Library/Extensions/prl_netbridge.kext - ineligible during safe boot.


Sep 13 21:07:07 computer-di-steve com.apple.kextd[9]: Load com.parallels.kext.prl_netbridge failed; removing personalities from kernel.


Sep 13 21:07:07 computer-di-steve com.apple.kextd[9]: Can't load /System/Library/Extensions/prl_vnic.kext - ineligible during safe boot.


Sep 13 21:07:07 computer-di-steve com.apple.kextd[9]: Load com.parallels.kext.prl_vnic failed; removing personalities from kernel.


Sep 13 21:07:07 computer-di-steve com.apple.kextcache[150]: JMicronATA.kext does not declare a kernel dependency; using com.apple.kernel.6.0.


Sep 13 21:07:12: --- last message repeated 2 times ---


Sep 13 21:07:12 computer-di-steve com.apple.kextcache[151]: / locked; waiting for lock.


Sep 13 21:07:31 computer-di-steve com.apple.kextcache[152]: / locked; waiting for lock.


Sep 13 21:07:44 computer-di-steve com.apple.kextcache[150]: Created prelinked kernel //System/Library/Caches/com.apple.kext.caches/Startup/kernelcache.


Sep 13 21:07:44 computer-di-steve com.apple.kextcache[149]: /: no supported helper partitions to update.


Sep 13 21:07:44 computer-di-steve com.apple.kextcache[151]: Lock acquired; proceeding.


Sep 13 21:07:44 computer-di-steve com.apple.kextcache[151]: /: no supported helper partitions to update.


Sep 13 21:07:44 computer-di-steve com.apple.kextcache[152]: Lock acquired; proceeding.


Sep 13 21:07:44 computer-di-steve com.apple.kextcache[152]: /: no supported helper partitions to update.


Sep 13 21:10:29 computer-di-steve SecurityAgent[134]: User info context values set for Steve


Sep 13 21:10:37: --- last message repeated 1 time ---


Sep 13 21:10:37 computer-di-steve SecurityAgent[134]: Login Window login proceeding


Sep 13 21:10:38 computer-di-steve loginwindow[73]: Login Window - Returned from Security Agent


Sep 13 21:10:38 computer-di-steve loginwindow[73]: USER_PROCESS: 73 console


Sep 13 21:10:39 computer-di-steve airportd[159]: _doAutoJoin: Already associated to “ESPAPPLEâ€. Bailing on auto-join.


Sep 13 21:10:39 computer-di-steve com.apple.launchd.peruser.501[161] (com.apple.ReportCrash): Falling back to default Mach exception handler. Could not find: com.apple.ReportCrash.Self


Sep 13 21:10:39 computer-di-steve com.apple.launchctl.Aqua[163]: load: option requires an argument -- D


Sep 13 21:10:39 computer-di-steve com.apple.launchctl.Aqua[163]: usage: launchctl load [-wF] [-D <user|local|network|system|all>] paths...


Sep 13 21:10:40 computer-di-steve UserEventAgent[10]: CaptiveNetworkSupport:CNSServerRegisterUserAgent:187 new user agent port: 43539


Sep 13 21:10:43 computer-di-steve mds[71]: (Warning) Server: No stores registered for metascope "kMDQueryScopeComputerIndexed"


Sep 13 21:10:43 computer-di-steve com.apple.launchd.peruser.501[161] (com.apple.launchctl.Aqua[163]): Exited with code: 1


Sep 13 21:10:47 computer-di-steve loginwindow[73]: ISGetIconFamilyFromStorage: seed mismatch for 238d0004, actual seed is 6b68079a


Sep 13 21:10:47: --- last message repeated 2 times ---


Sep 13 21:10:47 computer-di-steve loginwindow[73]: ISGetIconFamilyFromStorage: seed mismatch for 2f760005, actual seed is 4e6afb66


Sep 13 21:10:47 computer-di-steve loginwindow[73]: ISGetIconFamilyFromStorage: seed mismatch for 238d0004, actual seed is 6b68079a


Sep 13 21:10:47: --- last message repeated 1 time ---


Sep 13 21:10:47 computer-di-steve loginwindow[73]: ISGetIconFamilyFromStorage: seed mismatch for 2f760005, actual seed is 4e6afb66


Sep 13 21:10:47 computer-di-steve loginwindow[73]: ISGetIconFamilyFromStorage: seed mismatch for 238d0004, actual seed is 6b68079a


Sep 13 21:10:47 computer-di-steve loginwindow[73]: ISGetIconFamilyFromStorage: seed mismatch for 2f760005, actual seed is 4e6afb66


Sep 13 21:10:52 computer-di-steve fseventsd[18]: event logs in /Volumes/My Passport/.fseventsd out of sync with volume.  destroying old logs. (22232 2 47959)


Sep 13 21:10:52 computer-di-steve fseventsd[18]: log dir: /Volumes/My Passport/.fseventsd getting new uuid: D3D3CB54-5673-40E7-BABB-F209E39D90BF


Sep 13 21:10:56 computer-di-steve com.apple.launchd.peruser.501[161] (com.apple.mrt.uiagent[176]): Exited with code: 255


Sep 13 21:11:11 computer-di-steve SystemUIServer[186]: Could not load menu extra NSBundle </System/Library/CoreServices/Menu Extras/Volume.menu> (not yet loaded) for Class AppleVolumeExtra


Sep 13 21:11:15 computer-di-steve Finder[187]: ISGetIconFamilyFromStorage: seed mismatch for 200d001d, actual seed is 2901d82


Sep 13 21:11:15 computer-di-steve Finder[187]: _GetISImageRefFromIconRefInternal: could not retain image ref 0x200d001d (err=-2580)


Sep 13 21:11:15 computer-di-steve Finder[187]: ISGetIconFamilyFromStorage: seed mismatch for 200d001d, actual seed is 2901d82


Sep 13 21:11:15 computer-di-steve Finder[187]: _GetISImageRefFromIconRefInternal: could not retain image ref 0x200d001d (err=-2580)


Sep 13 21:11:16 computer-di-steve Finder[187]: ISGetIconFamilyFromStorage: seed mismatch for 27b7001e, actual seed is 3a95f874


Sep 13 21:11:16 computer-di-steve Finder[187]: _GetISImageRefFromIconRefInternal: could not retain image ref 0x27b7001e (err=-2580)


Sep 13 21:11:16 computer-di-steve Finder[187]: ISGetIconFamilyFromStorage: seed mismatch for 27b7001e, actual seed is 3a95f874


Sep 13 21:11:16 computer-di-steve Finder[187]: _GetISImageRefFromIconRefInternal: could not retain image ref 0x27b7001e (err=-2580)


Sep 13 21:11:16 computer-di-steve Finder[187]: ISGetIconFamilyFromStorage: seed mismatch for 295d0026, actual seed is 1e7ff521


Sep 13 21:11:16 computer-di-steve Finder[187]: _GetISImageRefFromIconRefInternal: could not retain image ref 0x295d0026 (err=-2580)


Sep 13 21:11:16 computer-di-steve Finder[187]: ISGetIconFamilyFromStorage: seed mismatch for 295d0026, actual seed is 1e7ff521


Sep 13 21:11:16 computer-di-steve Finder[187]: _GetISImageRefFromIconRefInternal: could not retain image ref 0x295d0026 (err=-2580)


Sep 13 21:11:16 computer-di-steve Finder[187]: ISGetIconFamilyFromStorage: seed mismatch for 2dab0027, actual seed is 7c3dbd3d


Sep 13 21:11:16 computer-di-steve Finder[187]: _GetISImageRefFromIconRefInternal: could not retain image ref 0x2dab0027 (err=-2580)


Sep 13 21:11:16 computer-di-steve Finder[187]: ISGetIconFamilyFromStorage: seed mismatch for 2dab0027, actual seed is 7c3dbd3d


Sep 13 21:11:16 computer-di-steve Finder[187]: _GetISImageRefFromIconRefInternal: could not retain image ref 0x2dab0027 (err=-2580)


Sep 13 21:11:17 computer-di-steve com.apple.dock.extra[216]: Could not connect the action buttonPressed: to target of class NSApplication


Sep 13 21:11:17 computer-di-steve com.apple.dock.extra[216]: 2013-09-13 21:11:17.550 com.apple.dock.extra[216:1a07] Could not connect the action buttonPressed: to target of class NSApplication


Sep 13 21:11:17 computer-di-steve com.apple.dock.extra[216]: Could not connect the action buttonPressed: to target of class NSApplication


Sep 13 21:11:17 computer-di-steve com.apple.dock.extra[216]: 2013-09-13 21:11:17.563 com.apple.dock.extra[216:1a07] Could not connect the action buttonPressed: to target of class NSApplication


Sep 13 21:11:17 computer-di-steve com.apple.dock.extra[216]: Could not connect the action buttonPressed: to target of class NSApplication


Sep 13 21:11:17 computer-di-steve com.apple.dock.extra[216]: 2013-09-13 21:11:17.564 com.apple.dock.extra[216:1a07] Could not connect the action buttonPressed: to target of class NSApplication


Sep 13 21:11:17 computer-di-steve com.apple.dock.extra[216]: Could not connect the action buttonPressed: to target of class NSApplication


Sep 13 21:11:17 computer-di-steve com.apple.dock.extra[216]: 2013-09-13 21:11:17.565 com.apple.dock.extra[216:1a07] Could not connect the action buttonPressed: to target of class NSApplication


Sep 13 21:11:22 computer-di-steve mds[71]: (Warning) Server: No stores registered for metascope "kMDQueryScopeComputer"


Sep 13 21:11:39 computer-di-steve ubd[217]: can not configure ubd while in config only mode. forcing a restart


Sep 13 21:11:43 computer-di-steve talagent[172]: kCGErrorIllegalArgument: CGSBindSurface: Invalid window 0x1d


Sep 13 21:11:43 computer-di-steve talagent[172]: kCGErrorFailure: Set a breakpoint @ CGErrorBreakpoint() to catch errors as they are logged.


Sep 13 21:11:43 computer-di-steve talagent[172]: kCGErrorIllegalArgument: CGSBindSurface: Invalid window 0x1c


Sep 13 21:11:46 computer-di-steve SyncServer[229]: [0x7fc9c3c170a0] |DataManager|Warning| Client com.apple.isyncDU.ipod.A27001BAFB8E8 image file path /System/Library/PrivateFrameworks/iPodSync.framework/Resources/ipod_4g.tiff does not exist.


Sep 13 21:13:42 computer-di-steve helpd[179]: Could not find access page in directory /Applications/Final Cut Express HD.app/Contents/Resources/English.lproj/Final Cut Express Help


Sep 13 21:13:52: --- last message repeated 1 time ---


Sep 13 21:13:52 computer-di-steve helpd[179]: CFPropertyListCreateFromXMLData(): Old-style plist parser: missing semicolon in dictionary.


Sep 13 21:14:22: --- last message repeated 1 time ---


Sep 13 21:15:43 computer-di-steve talagent[172]: PersistentUI: CSBackupSetItemExcluded() failed with OSStatus -61


Sep 13 21:20:43 computer-di-steve Finder[187]: ISGetIconFamilyFromStorage: seed mismatch for 200d001d, actual seed is 2901d82


Sep 13 21:20:43 computer-di-steve Finder[187]: ISGetIconFamilyFromStorage: seed mismatch for 27b7001e, actual seed is 3a95f874


Sep 13 21:20:43 computer-di-steve Finder[187]: ISGetIconFamilyFromStorage: seed mismatch for 295d0026, actual seed is 1e7ff521


Sep 13 21:20:43 computer-di-steve Finder[187]: ISGetIconFamilyFromStorage: seed mismatch for 2dab0027, actual seed is 7c3dbd3d


Sep 13 21:20:48 computer-di-steve warmd[58]: [__warmctl_evt_desktop_up_block_invoke_0:478] Desktop up bcstop timer fired!


Sep 13 21:20:53 computer-di-steve [0x0-0x13013].com.google.Chrome[241]: [241:161795:0913/212053:ERROR:backend_impl.cc(989)] Critical error found -8


Sep 13 21:20:53 computer-di-steve [0x0-0x13013].com.google.Chrome[241]: [241:161795:0913/212053:ERROR:entry_impl.cc(1018)] No file for c1030e20


Sep 13 21:20:55 computer-di-steve mds[71]: (Error) Server: Disabled store registered for scope "/Library/Application Support/Apple/Fonts"


Sep 13 21:20:57 computer-di-steve [0x0-0x13013].com.google.Chrome[241]: [241:138499:0913/212057:ERROR:audio_manager_base.cc(244)] Invalid audio output parameters received; using fake audio path. Channels: 2, Sample Rate: 0, Bits Per Sample: 16, Frames Per Buffer: 128


Sep 13 21:21:10 computer-di-steve [0x0-0x13013].com.google.Chrome[241]: IOSurface couldn't open service: IOSurfaceRoot


Sep 13 21:21:11 computer-di-steve [0x0-0x13013].com.google.Chrome[241]: [277:138499:0913/212111:ERROR:v8_value_converter_impl.cc(387)] Getter for property selectionDirection threw an exception.


Sep 13 21:21:11 computer-di-steve [0x0-0x13013].com.google.Chrome[241]: [277:138499:0913/212111:ERROR:v8_value_converter_impl.cc(387)] Getter for property selectionEnd threw an exception.


Sep 13 21:21:11 computer-di-steve [0x0-0x13013].com.google.Chrome[241]: [277:138499:0913/212111:ERROR:v8_value_converter_impl.cc(387)] Getter for property selectionStart threw an exception.


Sep 13 21:21:11 computer-di-steve [0x0-0x13013].com.google.Chrome[241]: [277:138499:0913/212111:ERROR:v8_value_converter_impl.cc(387)] Getter for property selectionDirection threw an exception.


Sep 13 21:21:11 computer-di-steve [0x0-0x13013].com.google.Chrome[241]: [277:138499:0913/212111:ERROR:v8_value_converter_impl.cc(387)] Getter for property selectionEnd threw an exception.


Sep 13 21:21:11 computer-di-steve [0x0-0x13013].com.google.Chrome[241]: [277:138499:0913/212111:ERROR:v8_value_converter_impl.cc(387)] Getter for property selectionStart threw an exception.


Sep 13 21:21:11 computer-di-steve [0x0-0x13013].com.google.Chrome[241]: [277:138499:0913/212111:ERROR:v8_value_converter_impl.cc(387)] Getter for property selectionDirection threw an exception.


Sep 13 21:21:11 computer-di-steve [0x0-0x13013].com.google.Chrome[241]: [277:138499:0913/212111:ERROR:v8_value_converter_impl.cc(387)] Getter for property selectionEnd threw an exception.


Sep 13 21:21:11 computer-di-steve [0x0-0x13013].com.google.Chrome[241]: [277:138499:0913/212111:ERROR:v8_value_converter_impl.cc(387)] Getter for property selectionStart threw an exception.


Sep 13 21:21:11 computer-di-steve [0x0-0x13013].com.google.Chrome[241]: [277:138499:0913/212111:ERROR:v8_value_converter_impl.cc(387)] Getter for property selectionDirection threw an exception.


Sep 13 21:21:11 computer-di-steve [0x0-0x13013].com.google.Chrome[241]: [277:138499:0913/212111:ERROR:v8_value_converter_impl.cc(387)] Getter for property selectionEnd threw an exception.


Sep 13 21:21:11 computer-di-steve [0x0-0x13013].com.google.Chrome[241]: [277:138499:0913/212111:ERROR:v8_value_converter_impl.cc(387)] Getter for property selectionStart threw an exception.


Sep 13 21:21:11 computer-di-steve [0x0-0x13013].com.google.Chrome[241]: IOSurface couldn't open service: IOSurfaceRoot


Sep 13 21:21:11 computer-di-steve [0x0-0x13013].com.google.Chrome[241]: [241:138499:0913/212111:ERROR:render_widget_host_view_mac.mm(1255)] Failed SetIOSurface on CompositingIOSurfaceMac


Sep 13 21:21:12 computer-di-steve [0x0-0x13013].com.google.Chrome[241]: [241:138499:0913/212112:ERROR:render_widget_host_view_mac.mm(1255)] Failed SetIOSurface on CompositingIOSurfaceMac


Sep 13 21:21:12: --- last message repeated 1 time ---


Sep 13 21:21:12 computer-di-steve [0x0-0x13013].com.google.Chrome[241]: [277:138499:0913/212112:ERROR:v8_value_converter_impl.cc(387)] Getter for property selectionDirection threw an exception.


Sep 13 21:21:12 computer-di-steve [0x0-0x13013].com.google.Chrome[241]: [277:138499:0913/212112:ERROR:v8_value_converter_impl.cc(387)] Getter for property selectionEnd threw an exception.


Sep 13 21:21:12 computer-di-steve [0x0-0x13013].com.google.Chrome[241]: [277:138499:0913/212112:ERROR:v8_value_converter_impl.cc(387)] Getter for property selectionStart threw an exception.


Sep 13 21:21:12 computer-di-steve [0x0-0x13013].com.google.Chrome[241]: [277:138499:0913/212112:ERROR:v8_value_converter_impl.cc(387)] Getter for property selectionDirection threw an exception.


Sep 13 21:21:12 computer-di-steve [0x0-0x13013].com.google.Chrome[241]: [277:138499:0913/212112:ERROR:v8_value_converter_impl.cc(387)] Getter for property selectionEnd threw an exception.


Sep 13 21:21:12 computer-di-steve [0x0-0x13013].com.google.Chrome[241]: [277:138499:0913/212112:ERROR:v8_value_converter_impl.cc(387)] Getter for property selectionStart threw an exception.


Sep 13 21:21:12 computer-di-steve [0x0-0x13013].com.google.Chrome[241]: [277:138499:0913/212112:ERROR:v8_value_converter_impl.cc(387)] Getter for property selectionDirection threw an exception.


Sep 13 21:21:12 computer-di-steve [0x0-0x13013].com.google.Chrome[241]: [277:138499:0913/212112:ERROR:v8_value_converter_impl.cc(387)] Getter for property selectionEnd threw an exception.


Sep 13 21:21:12 computer-di-steve [0x0-0x13013].com.google.Chrome[241]: [277:138499:0913/212112:ERROR:v8_value_converter_impl.cc(387)] Getter for property selectionStart threw an exception.


Sep 13 21:21:12 computer-di-steve [0x0-0x13013].com.google.Chrome[241]: [277:138499:0913/212112:ERROR:v8_value_converter_impl.cc(387)] Getter for property selectionDirection threw an exception.


Sep 13 21:21:12 computer-di-steve [0x0-0x13013].com.google.Chrome[241]: [277:138499:0913/212112:ERROR:v8_value_converter_impl.cc(387)] Getter for property selectionEnd threw an exception.


Sep 13 21:21:12 computer-di-steve [0x0-0x13013].com.google.Chrome[241]: [277:138499:0913/212112:ERROR:v8_value_converter_impl.cc(387)] Getter for property selectionStart threw an exception.


Sep 13 21:21:12 computer-di-steve [0x0-0x13013].com.google.Chrome[241]: [277:138499:0913/212112:ERROR:v8_value_converter_impl.cc(387)] Getter for property selectionDirection threw an exception.


Sep 13 21:21:12 computer-di-steve [0x0-0x13013].com.google.Chrome[241]: [277:138499:0913/212112:ERROR:v8_value_converter_impl.cc(387)] Getter for property selectionEnd threw an exception.


Sep 13 21:21:12 computer-di-steve [0x0-0x13013].com.google.Chrome[241]: [277:138499:0913/212112:ERROR:v8_value_converter_impl.cc(387)] Getter for property selectionStart threw an exception.


Sep 13 21:21:12 computer-di-steve [0x0-0x13013].com.google.Chrome[241]: [277:138499:0913/212112:ERROR:v8_value_converter_impl.cc(387)] Getter for property selectionDirection threw an exception.


Sep 13 21:21:12 computer-di-steve [0x0-0x13013].com.google.Chrome[241]: [277:138499:0913/212112:ERROR:v8_value_converter_impl.cc(387)] Getter for property selectionEnd threw an exception.


Sep 13 21:21:12 computer-di-steve [0x0-0x13013].com.google.Chrome[241]: [277:138499:0913/212112:ERROR:v8_value_converter_impl.cc(387)] Getter for property selectionStart threw an exception.


Sep 13 21:21:12 computer-di-steve [0x0-0x13013].com.google.Chrome[241]: [277:138499:0913/212112:ERROR:v8_value_converter_impl.cc(387)] Getter for property selectionDirection threw an exception.


Sep 13 21:21:12 computer-di-steve [0x0-0x13013].com.google.Chrome[241]: [277:138499:0913/212112:ERROR:v8_value_converter_impl.cc(387)] Getter for property selectionEnd threw an exception.


Sep 13 21:21:12 computer-di-steve [0x0-0x13013].com.google.Chrome[241]: [277:138499:0913/212112:ERROR:v8_value_converter_impl.cc(387)] Getter for property selectionStart threw an exception.


Sep 13 21:21:12 computer-di-steve [0x0-0x13013].com.google.Chrome[241]: [277:138499:0913/212112:ERROR:v8_value_converter_impl.cc(387)] Getter for property selectionDirection threw an exception.


Sep 13 21:21:12 computer-di-steve [0x0-0x13013].com.google.Chrome[241]: [277:138499:0913/212112:ERROR:v8_value_converter_impl.cc(387)] Getter for property selectionEnd threw an exception.


Sep 13 21:21:12 computer-di-steve [0x0-0x13013].com.google.Chrome[241]: [277:138499:0913/212112:ERROR:v8_value_converter_impl.cc(387)] Getter for property selectionStart threw an exception.


Sep 13 21:21:12 computer-di-steve [0x0-0x13013].com.google.Chrome[241]: [277:138499:0913/212112:ERROR:v8_value_converter_impl.cc(387)] Getter for property selectionDirection threw an exception.


Sep 13 21:21:12 computer-di-steve [0x0-0x13013].com.google.Chrome[241]: [277:138499:0913/212112:ERROR:v8_value_converter_impl.cc(387)] Getter for property selectionEnd threw an exception.


Sep 13 21:21:12 computer-di-steve [0x0-0x13013].com.google.Chrome[241]: [277:138499:0913/212112:ERROR:v8_value_converter_impl.cc(387)] Getter for property selectionStart threw an exception.


Sep 13 21:21:13 computer-di-steve [0x0-0x13013].com.google.Chrome[241]: [241:138499:0913/212113:ERROR:render_widget_host_view_mac.mm(1255)] Failed SetIOSurface on CompositingIOSurfaceMac


Sep 13 21:21:15 computer-di-steve [0x0-0x13013].com.google.Chrome[241]: [241:138499:0913/212115:ERROR:render_widget_host_view_mac.mm(1255)] Failed SetIOSurface on CompositingIOSurfaceMac


Sep 13 21:21:17 computer-di-steve [0x0-0x13013].com.google.Chrome[241]: [241:138499:0913/212117:ERROR:render_widget_host_view_mac.mm(1255)] Failed SetIOSurface on CompositingIOSurfaceMac


Sep 13 21:21:23 computer-di-steve [0x0-0x13013].com.google.Chrome[241]: [286:138499:0913/212123:ERROR:v8_value_converter_impl.cc(387)] Getter for property selectionDirection threw an exception.


Sep 13 21:21:23 computer-di-steve [0x0-0x13013].com.google.Chrome[241]: [286:138499:0913/212123:ERROR:v8_value_converter_impl.cc(387)] Getter for property selectionEnd threw an exception.


Sep 13 21:21:23 computer-di-steve [0x0-0x13013].com.google.Chrome[241]: [286:138499:0913/212123:ERROR:v8_value_converter_impl.cc(387)] Getter for property selectionStart threw an exception.


Sep 13 21:21:23 computer-di-steve [0x0-0x13013].com.google.Chrome[241]: [286:138499:0913/212123:ERROR:v8_value_converter_impl.cc(387)] Getter for property selectionDirection threw an exception.


Sep 13 21:21:23 computer-di-steve [0x0-0x13013].com.google.Chrome[241]: [286:138499:0913/212123:ERROR:v8_value_converter_impl.cc(387)] Getter for property selectionEnd threw an exception.


Sep 13 21:21:23 computer-di-steve [0x0-0x13013].com.google.Chrome[241]: [286:138499:0913/212123:ERROR:v8_value_converter_impl.cc(387)] Getter for property selectionStart threw an exception.


Sep 13 21:21:23 computer-di-steve [0x0-0x13013].com.google.Chrome[241]: [286:138499:0913/212123:ERROR:v8_value_converter_impl.cc(387)] Getter for property selectionDirection threw an exception.


Sep 13 21:21:23 computer-di-steve [0x0-0x13013].com.google.Chrome[241]: [286:138499:0913/212123:ERROR:v8_value_converter_impl.cc(387)] Getter for property selectionEnd threw an exception.


Sep 13 21:21:23 computer-di-steve [0x0-0x13013].com.google.Chrome[241]: [286:138499:0913/212123:ERROR:v8_value_converter_impl.cc(387)] Getter for property selectionStart threw an exception.


Sep 13 21:21:23 computer-di-steve [0x0-0x13013].com.google.Chrome[241]: [286:138499:0913/212123:ERROR:v8_value_converter_impl.cc(387)] Getter for property selectionDirection threw an exception.


Sep 13 21:21:23 computer-di-steve [0x0-0x13013].com.google.Chrome[241]: [286:138499:0913/212123:ERROR:v8_value_converter_impl.cc(387)] Getter for property selectionEnd threw an exception.


Sep 13 21:21:23 computer-di-steve [0x0-0x13013].com.google.Chrome[241]: [286:138499:0913/212123:ERROR:v8_value_converter_impl.cc(387)] Getter for property selectionStart threw an exception.


Sep 13 21:21:24 computer-di-steve [0x0-0x13013].com.google.Chrome[241]: [286:138499:0913/212124:ERROR:v8_value_converter_impl.cc(387)] Getter for property selectionDirection threw an exception.


Sep 13 21:21:24 computer-di-steve [0x0-0x13013].com.google.Chrome[241]: [286:138499:0913/212124:ERROR:v8_value_converter_impl.cc(387)] Getter for property selectionEnd threw an exception.


Sep 13 21:21:24 computer-di-steve [0x0-0x13013].com.google.Chrome[241]: [286:138499:0913/212124:ERROR:v8_value_converter_impl.cc(387)] Getter for property selectionStart threw an exception.


Sep 13 21:21:24 computer-di-steve [0x0-0x13013].com.google.Chrome[241]: [286:138499:0913/212124:ERROR:v8_value_converter_impl.cc(387)] Getter for property selectionDirection threw an exception.


Sep 13 21:21:24 computer-di-steve [0x0-0x13013].com.google.Chrome[241]: [286:138499:0913/212124:ERROR:v8_value_converter_impl.cc(387)] Getter for property selectionEnd threw an exception.


Sep 13 21:21:24 computer-di-steve [0x0-0x13013].com.google.Chrome[241]: [286:138499:0913/212124:ERROR:v8_value_converter_impl.cc(387)] Getter for property selectionStart threw an exception.


Sep 13 21:21:24 computer-di-steve [0x0-0x13013].com.google.Chrome[241]: [286:138499:0913/212124:ERROR:v8_value_converter_impl.cc(387)] Getter for property selectionDirection threw an exception.


Sep 13 21:21:24 computer-di-steve [0x0-0x13013].com.google.Chrome[241]: [286:138499:0913/212124:ERROR:v8_value_converter_impl.cc(387)] Getter for property selectionEnd threw an exception.


Sep 13 21:21:24 computer-di-steve [0x0-0x13013].com.google.Chrome[241]: [286:138499:0913/212124:ERROR:v8_value_converter_impl.cc(387)] Getter for property selectionStart threw an exception.


Sep 13 21:21:24 computer-di-steve [0x0-0x13013].com.google.Chrome[241]: [286:138499:0913/212124:ERROR:v8_value_converter_impl.cc(387)] Getter for property selectionDirection threw an exception.


Sep 13 21:21:24 computer-di-steve [0x0-0x13013].com.google.Chrome[241]: [286:138499:0913/212124:ERROR:v8_value_converter_impl.cc(387)] Getter for property selectionEnd threw an exception.


Sep 13 21:21:24 computer-di-steve [0x0-0x13013].com.google.Chrome[241]: [286:138499:0913/212124:ERROR:v8_value_converter_impl.cc(387)] Getter for property selectionStart threw an exception.


Sep 13 21:21:24 computer-di-steve [0x0-0x13013].com.google.Chrome[241]: [286:138499:0913/212124:ERROR:v8_value_converter_impl.cc(387)] Getter for property selectionDirection threw an exception.


Sep 13 21:21:24 computer-di-steve [0x0-0x13013].com.google.Chrome[241]: [286:138499:0913/212124:ERROR:v8_value_converter_impl.cc(387)] Getter for property selectionEnd threw an exception.


Sep 13 21:21:24 computer-di-steve [0x0-0x13013].com.google.Chrome[241]: [286:138499:0913/212124:ERROR:v8_value_converter_impl.cc(387)] Getter for property selectionStart threw an exception.


Sep 13 21:21:24 computer-di-steve [0x0-0x13013].com.google.Chrome[241]: [286:138499:0913/212124:ERROR:v8_value_converter_impl.cc(387)] Getter for property selectionDirection threw an exception.


Sep 13 21:21:24 computer-di-steve [0x0-0x13013].com.google.Chrome[241]: [286:138499:0913/212124:ERROR:v8_value_converter_impl.cc(387)] Getter for property selectionEnd threw an exception.


Sep 13 21:21:24 computer-di-steve [0x0-0x13013].com.google.Chrome[241]: [286:138499:0913/212124:ERROR:v8_value_converter_impl.cc(387)] Getter for property selectionStart threw an exception.


Sep 13 21:21:24 computer-di-steve [0x0-0x13013].com.google.Chrome[241]: [286:138499:0913/212124:ERROR:v8_value_converter_impl.cc(387)] Getter for property selectionDirection threw an exception.


Sep 13 21:21:24 computer-di-steve [0x0-0x13013].com.google.Chrome[241]: [286:138499:0913/212124:ERROR:v8_value_converter_impl.cc(387)] Getter for property selectionEnd threw an exception.


Sep 13 21:21:24 computer-di-steve [0x0-0x13013].com.google.Chrome[241]: [286:138499:0913/212124:ERROR:v8_value_converter_impl.cc(387)] Getter for property selectionStart threw an exception.


Sep 13 21:21:24 computer-di-steve [0x0-0x13013].com.google.Chrome[241]: [286:138499:0913/212124:ERROR:v8_value_converter_impl.cc(387)] Getter for property selectionDirection threw an exception.


Sep 13 21:21:24 computer-di-steve [0x0-0x13013].com.google.Chrome[241]: [286:138499:0913/212124:ERROR:v8_value_converter_impl.cc(387)] Getter for property selectionEnd threw an exception.


Sep 13 21:21:24 computer-di-steve [0x0-0x13013].com.google.Chrome[241]: [286:138499:0913/212124:ERROR:v8_value_converter_impl.cc(387)] Getter for property selectionStart threw an exception.


Sep 13 21:21:24 computer-di-steve [0x0-0x13013].com.google.Chrome[241]: [286:138499:0913/212124:ERROR:v8_value_converter_impl.cc(387)] Getter for property selectionDirection threw an exception.


Sep 13 21:21:24 computer-di-steve [0x0-0x13013].com.google.Chrome[241]: [286:138499:0913/212124:ERROR:v8_value_converter_impl.cc(387)] Getter for property selectionEnd threw an exception.


Sep 13 21:21:24 computer-di-steve [0x0-0x13013].com.google.Chrome[241]: [286:138499:0913/212124:ERROR:v8_value_converter_impl.cc(387)] Getter for property selectionStart threw an exception.


Sep 13 21:21:24 computer-di-steve VDCAssistant[290]: AVF encoder error: fail to create accelerator instance 


Sep 13 21:21:30 computer-di-steve [0x0-0x13013].com.google.Chrome[241]: [276:138499:0913/212130:ERROR:v8_value_converter_impl.cc(387)] Getter for property selectionDirection threw an exception.


Sep 13 21:21:30 computer-di-steve [0x0-0x13013].com.google.Chrome[241]: [276:138499:0913/212130:ERROR:v8_value_converter_impl.cc(387)] Getter for property selectionEnd threw an exception.


Sep 13 21:21:30 computer-di-steve [0x0-0x13013].com.google.Chrome[241]: [276:138499:0913/212130:ERROR:v8_value_converter_impl.cc(387)] Getter for property selectionStart threw an exception.


Sep 13 21:21:30 computer-di-steve [0x0-0x13013].com.google.Chrome[241]: [276:138499:0913/212130:ERROR:v8_value_converter_impl.cc(387)] Getter for property selectionDirection threw an exception.


Sep 13 21:21:30 computer-di-steve [0x0-0x13013].com.google.Chrome[241]: [276:138499:0913/212130:ERROR:v8_value_converter_impl.cc(387)] Getter for property selectionEnd threw an exception.


Sep 13 21:21:30 computer-di-steve [0x0-0x13013].com.google.Chrome[241]: [276:138499:0913/212130:ERROR:v8_value_converter_impl.cc(387)] Getter for property selectionStart threw an exception.


Sep 13 21:21:30 computer-di-steve [0x0-0x13013].com.google.Chrome[241]: [276:138499:0913/212130:ERROR:v8_value_converter_impl.cc(387)] Getter for property selectionDirection threw an exception.


Sep 13 21:21:30 computer-di-steve [0x0-0x13013].com.google.Chrome[241]: [276:138499:0913/212130:ERROR:v8_value_converter_impl.cc(387)] Getter for property selectionEnd threw an exception.


Sep 13 21:21:30 computer-di-steve [0x0-0x13013].com.google.Chrome[241]: [276:138499:0913/212130:ERROR:v8_value_converter_impl.cc(387)] Getter for property selectionStart threw an exception.


Sep 13 21:21:30 computer-di-steve [0x0-0x13013].com.google.Chrome[241]: [278:138499:0913/212130:ERROR:v8_value_converter_impl.cc(387)] Getter for property selectionDirection threw an exception.


Sep 13 21:21:30 computer-di-steve [0x0-0x13013].com.google.Chrome[241]: [278:138499:0913/212130:ERROR:v8_value_converter_impl.cc(387)] Getter for property selectionEnd threw an exception.


Sep 13 21:21:30 computer-di-steve [0x0-0x13013].com.google.Chrome[241]: [278:138499:0913/212130:ERROR:v8_value_converter_impl.cc(387)] Getter for property selectionStart threw an exception.


Sep 13 21:21:30 computer-di-steve [0x0-0x13013].com.google.Chrome[241]: [278:138499:0913/212130:ERROR:v8_value_converter_impl.cc(387)] Getter for property selectionDirection threw an exception.


Sep 13 21:21:30 computer-di-steve [0x0-0x13013].com.google.Chrome[241]: [278:138499:0913/212130:ERROR:v8_value_converter_impl.cc(387)] Getter for property selectionEnd threw an exception.


Sep 13 21:21:30 computer-di-steve [0x0-0x13013].com.google.Chrome[241]: [278:138499:0913/212130:ERROR:v8_value_converter_impl.cc(387)] Getter for property selectionStart threw an exception.


Sep 13 21:21:30 computer-di-steve [0x0-0x13013].com.google.Chrome[241]: [278:138499:0913/212130:ERROR:v8_value_converter_impl.cc(387)] Getter for property selectionDirection threw an exception.


Sep 13 21:21:30 computer-di-steve [0x0-0x13013].com.google.Chrome[241]: [278:138499:0913/212130:ERROR:v8_value_converter_impl.cc(387)] Getter for property selectionEnd threw an exception.


Sep 13 21:21:30 computer-di-steve [0x0-0x13013].com.google.Chrome[241]: [278:138499:0913/212130:ERROR:v8_value_converter_impl.cc(387)] Getter for property selectionStart threw an exception.


Sep 13 21:21:30 computer-di-steve [0x0-0x13013].com.google.Chrome[241]: [278:138499:0913/212130:ERROR:v8_value_converter_impl.cc(387)] Getter for property selectionDirection threw an exception.


Sep 13 21:21:30 computer-di-steve [0x0-0x13013].com.google.Chrome[241]: [278:138499:0913/212130:ERROR:v8_value_converter_impl.cc(387)] Getter for property selectionEnd threw an exception.


Sep 13 21:21:30 computer-di-steve [0x0-0x13013].com.google.Chrome[241]: [278:138499:0913/212130:ERROR:v8_value_converter_impl.cc(387)] Getter for property selectionStart threw an exception.


Sep 13 21:21:30 computer-di-steve [0x0-0x13013].com.google.Chrome[241]: [278:138499:0913/212130:ERROR:v8_value_converter_impl.cc(387)] Getter for property selectionDirection threw an exception.


Sep 13 21:21:30 computer-di-steve [0x0-0x13013].com.google.Chrome[241]: [278:138499:0913/212130:ERROR:v8_value_converter_impl.cc(387)] Getter for property selectionEnd threw an exception.


Sep 13 21:21:30 computer-di-steve [0x0-0x13013].com.google.Chrome[241]: [278:138499:0913/212130:ERROR:v8_value_converter_impl.cc(387)] Getter for property selectionStart threw an exception.


Sep 13 21:21:30 computer-di-steve [0x0-0x13013].com.google.Chrome[241]: [278:138499:0913/212130:ERROR:v8_value_converter_impl.cc(387)] Getter for property selectionDirection threw an exception.


Sep 13 21:21:30 computer-di-steve [0x0-0x13013].com.google.Chrome[241]: [278:138499:0913/212130:ERROR:v8_value_converter_impl.cc(387)] Getter for property selectionEnd threw an exception.


Sep 13 21:21:30 computer-di-steve [0x0-0x13013].com.google.Chrome[241]: [278:138499:0913/212130:ERROR:v8_value_converter_impl.cc(387)] Getter for property selectionStart threw an exception.


Sep 13 21:21:30 computer-di-steve [0x0-0x13013].com.google.Chrome[241]: [278:138499:0913/212130:ERROR:v8_value_converter_impl.cc(387)] Getter for property selectionDirection threw an exception.


Sep 13 21:21:30 computer-di-steve [0x0-0x13013].com.google.Chrome[241]: [278:138499:0913/212130:ERROR:v8_value_converter_impl.cc(387)] Getter for property selectionEnd threw an exception.


Sep 13 21:21:30 computer-di-steve [0x0-0x13013].com.google.Chrome[241]: [278:138499:0913/212130:ERROR:v8_value_converter_impl.cc(387)] Getter for property selectionStart threw an exception.


Sep 13 21:21:30 computer-di-steve [0x0-0x13013].com.google.Chrome[241]: [278:138499:0913/212130:ERROR:v8_value_converter_impl.cc(387)] Getter for property selectionDirection threw an exception.


Sep 13 21:21:30 computer-di-steve [0x0-0x13013].com.google.Chrome[241]: [278:138499:0913/212130:ERROR:v8_value_converter_impl.cc(387)] Getter for property selectionEnd threw an exception.


Sep 13 21:21:30 computer-di-steve [0x0-0x13013].com.google.Chrome[241]: [278:138499:0913/212130:ERROR:v8_value_converter_impl.cc(387)] Getter for property selectionStart threw an exception.


Sep 13 21:21:35 computer-di-steve [0x0-0x13013].com.google.Chrome[241]: [278:138499:0913/212135:ERROR:v8_value_converter_impl.cc(387)] Getter for property selectionDirection threw an exception.


Sep 13 21:21:35 computer-di-steve [0x0-0x13013].com.google.Chrome[241]: [278:138499:0913/212135:ERROR:v8_value_converter_impl.cc(387)] Getter for property selectionEnd threw an exception.


Sep 13 21:21:35 computer-di-steve [0x0-0x13013].com.google.Chrome[241]: [278:138499:0913/212135:ERROR:v8_value_converter_impl.cc(387)] Getter for property selectionStart threw an exception.


Sep 13 21:21:35 computer-di-steve [0x0-0x13013].com.google.Chrome[241]: [278:138499:0913/212135:ERROR:v8_value_converter_impl.cc(387)] Getter for property selectionDirection threw an exception.


Sep 13 21:21:35 computer-di-steve [0x0-0x13013].com.google.Chrome[241]: [278:138499:0913/212135:ERROR:v8_value_converter_impl.cc(387)] Getter for property selectionEnd threw an exception.


Sep 13 21:21:35 computer-di-steve [0x0-0x13013].com.google.Chrome[241]: [278:138499:0913/212135:ERROR:v8_value_converter_impl.cc(387)] Getter for property selectionStart threw an exception.


Sep 13 21:21:35 computer-di-steve [0x0-0x13013].com.google.Chrome[241]: [278:138499:0913/212135:ERROR:v8_value_converter_impl.cc(387)] Getter for property selectionDirection threw an exception.


Sep 13 21:21:35 computer-di-steve [0x0-0x13013].com.google.Chrome[241]: [278:138499:0913/212135:ERROR:v8_value_converter_impl.cc(387)] Getter for property selectionEnd threw an exception.


Sep 13 21:21:35 computer-di-steve [0x0-0x13013].com.google.Chrome[241]: [278:138499:0913/212135:ERROR:v8_value_converter_impl.cc(387)] Getter for property selectionStart threw an exception.


Sep 13 21:21:35 computer-di-steve [0x0-0x13013].com.google.Chrome[241]: [278:138499:0913/212135:ERROR:v8_value_converter_impl.cc(387)] Getter for property selectionDirection threw an exception.


Sep 13 21:21:35 computer-di-steve [0x0-0x13013].com.google.Chrome[241]: [278:138499:0913/212135:ERROR:v8_value_converter_impl.cc(387)] Getter for property selectionEnd threw an exception.


Sep 13 21:21:35 computer-di-steve [0x0-0x13013].com.google.Chrome[241]: [278:138499:0913/212135:ERROR:v8_value_converter_impl.cc(387)] Getter for property selectionStart threw an exception.


Sep 13 21:21:35 computer-di-steve [0x0-0x13013].com.google.Chrome[241]: [278:138499:0913/212135:ERROR:v8_value_converter_impl.cc(387)] Getter for property selectionDirection threw an exception.


Sep 13 21:21:35 computer-di-steve [0x0-0x13013].com.google.Chrome[241]: [278:138499:0913/212135:ERROR:v8_value_converter_impl.cc(387)] Getter for property selectionEnd threw an exception.


Sep 13 21:21:35 computer-di-steve [0x0-0x13013].com.google.Chrome[241]: [278:138499:0913/212135:ERROR:v8_value_converter_impl.cc(387)] Getter for property selectionStart threw an exception.


Sep 13 21:21:35 computer-di-steve [0x0-0x13013].com.google.Chrome[241]: [278:138499:0913/212135:ERROR:v8_value_converter_impl.cc(387)] Getter for property selectionDirection threw an exception.


Sep 13 21:21:35 computer-di-steve [0x0-0x13013].com.google.Chrome[241]: [278:138499:0913/212135:ERROR:v8_value_converter_impl.cc(387)] Getter for property selectionEnd threw an exception.


Sep 13 21:21:35 computer-di-steve [0x0-0x13013].com.google.Chrome[241]: [278:138499:0913/212135:ERROR:v8_value_converter_impl.cc(387)] Getter for property selectionStart threw an exception.


Sep 13 21:21:35 computer-di-steve [0x0-0x13013].com.google.Chrome[241]: [278:138499:0913/212135:ERROR:v8_value_converter_impl.cc(387)] Getter for property selectionDirection threw an exception.


Sep 13 21:21:35 computer-di-steve [0x0-0x13013].com.google.Chrome[241]: [278:138499:0913/212135:ERROR:v8_value_converter_impl.cc(387)] Getter for property selectionEnd threw an exception.


Sep 13 21:21:35 computer-di-steve [0x0-0x13013].com.google.Chrome[241]: [278:138499:0913/212135:ERROR:v8_value_converter_impl.cc(387)] Getter for property selectionStart threw an exception.


Sep 13 21:21:35 computer-di-steve [0x0-0x13013].com.google.Chrome[241]: [278:138499:0913/212135:ERROR:v8_value_converter_impl.cc(387)] Getter for property selectionDirection threw an exception.


Sep 13 21:21:35 computer-di-steve [0x0-0x13013].com.google.Chrome[241]: [278:138499:0913/212135:ERROR:v8_value_converter_impl.cc(387)] Getter for property selectionEnd threw an exception.


Sep 13 21:21:35 computer-di-steve [0x0-0x13013].com.google.Chrome[241]: [278:138499:0913/212135:ERROR:v8_value_converter_impl.cc(387)] Getter for property selectionStart threw an exception.


Sep 13 21:21:35 computer-di-steve [0x0-0x13013].com.google.Chrome[241]: [278:138499:0913/212135:ERROR:v8_value_converter_impl.cc(387)] Getter for property selectionDirection threw an exception.


Sep 13 21:21:35 computer-di-steve [0x0-0x13013].com.google.Chrome[241]: [278:138499:0913/212135:ERROR:v8_value_converter_impl.cc(387)] Getter for property selectionEnd threw an exception.


Sep 13 21:21:35 computer-di-steve [0x0-0x13013].com.google.Chrome[241]: [278:138499:0913/212135:ERROR:v8_value_converter_impl.cc(387)] Getter for property selectionStart threw an exception.


Sep 13 21:21:35 computer-di-steve [0x0-0x13013].com.google.Chrome[241]: [278:138499:0913/212135:ERROR:v8_value_converter_impl.cc(387)] Getter for property selectionDirection threw an exception.


Sep 13 21:21:35 computer-di-steve [0x0-0x13013].com.google.Chrome[241]: [278:138499:0913/212135:ERROR:v8_value_converter_impl.cc(387)] Getter for property selectionEnd threw an exception.


Sep 13 21:21:35 computer-di-steve [0x0-0x13013].com.google.Chrome[241]: [278:138499:0913/212135:ERROR:v8_value_converter_impl.cc(387)] Getter for property selectionStart threw an exception.


Sep 13 21:21:35 computer-di-steve [0x0-0x13013].com.google.Chrome[241]: [278:138499:0913/212135:ERROR:v8_value_converter_impl.cc(387)] Getter for property selectionDirection threw an exception.


Sep 13 21:21:35 computer-di-steve [0x0-0x13013].com.google.Chrome[241]: [278:138499:0913/212135:ERROR:v8_value_converter_impl.cc(387)] Getter for property selectionEnd threw an exception.


Sep 13 21:21:35 computer-di-steve [0x0-0x13013].com.google.Chrome[241]: [278:138499:0913/212135:ERROR:v8_value_converter_impl.cc(387)] Getter for property selectionStart threw an exception.


Sep 13 21:21:35 computer-di-steve [0x0-0x13013].com.google.Chrome[241]: [278:138499:0913/212135:ERROR:v8_value_converter_impl.cc(387)] Getter for property selectionDirection threw an exception.


Sep 13 21:21:35 computer-di-steve [0x0-0x13013].com.google.Chrome[241]: [278:138499:0913/212135:ERROR:v8_value_converter_impl.cc(387)] Getter for property selectionEnd threw an exception.


Sep 13 21:21:35 computer-di-steve [0x0-0x13013].com.google.Chrome[241]: [278:138499:0913/212135:ERROR:v8_value_converter_impl.cc(387)] Getter for property selectionStart threw an exception.


Sep 13 21:21:35 computer-di-steve [0x0-0x13013].com.google.Chrome[241]: [278:138499:0913/212135:ERROR:v8_value_converter_impl.cc(387)] Getter for property selectionDirection threw an exception.


Sep 13 21:21:35 computer-di-steve [0x0-0x13013].com.google.Chrome[241]: [278:138499:0913/212135:ERROR:v8_value_converter_impl.cc(387)] Getter for property selectionEnd threw an exception.


Sep 13 21:21:35 computer-di-steve [0x0-0x13013].com.google.Chrome[241]: [278:138499:0913/212135:ERROR:v8_value_converter_impl.cc(387)] Getter for property selectionStart threw an exception.


Sep 13 21:21:35 computer-di-steve [0x0-0x13013].com.google.Chrome[241]: [278:138499:0913/212135:ERROR:v8_value_converter_impl.cc(387)] Getter for property selectionDirection threw an exception.


Sep 13 21:21:35 computer-di-steve [0x0-0x13013].com.google.Chrome[241]: [278:138499:0913/212135:ERROR:v8_value_converter_impl.cc(387)] Getter for property selectionEnd threw an exception.


Sep 13 21:21:35 computer-di-steve [0x0-0x13013].com.google.Chrome[241]: [278:138499:0913/212135:ERROR:v8_value_converter_impl.cc(387)] Getter for property selectionStart threw an exception.


Sep 13 21:21:35 computer-di-steve [0x0-0x13013].com.google.Chrome[241]: [278:138499:0913/212135:ERROR:v8_value_converter_impl.cc(387)] Getter for property selectionDirection threw an exception.


Sep 13 21:21:35 computer-di-steve [0x0-0x13013].com.google.Chrome[241]: [278:138499:0913/212135:ERROR:v8_value_converter_impl.cc(387)] Getter for property selectionEnd threw an exception.


Sep 13 21:21:35 computer-di-steve [0x0-0x13013].com.google.Chrome[241]: [278:138499:0913/212135:ERROR:v8_value_converter_impl.cc(387)] Getter for property selectionStart threw an exception.


Sep 13 21:21:35 computer-di-steve [0x0-0x13013].com.google.Chrome[241]: [278:138499:0913/212135:ERROR:v8_value_converter_impl.cc(387)] Getter for property selectionDirection threw an exception.


Sep 13 21:21:35 computer-di-steve [0x0-0x13013].com.google.Chrome[241]: [278:138499:0913/212135:ERROR:v8_value_converter_impl.cc(387)] Getter for property selectionEnd threw an exception.


Sep 13 21:21:35 computer-di-steve [0x0-0x13013].com.google.Chrome[241]: [278:138499:0913/212135:ERROR:v8_value_converter_impl.cc(387)] Getter for property selectionStart threw an exception.


Sep 13 21:21:35 computer-di-steve [0x0-0x13013].com.google.Chrome[241]: [278:138499:0913/212135:ERROR:v8_value_converter_impl.cc(387)] Getter for property selectionDirection threw an exception.


Sep 13 21:21:35 computer-di-steve [0x0-0x13013].com.google.Chrome[241]: [278:138499:0913/212135:ERROR:v8_value_converter_impl.cc(387)] Getter for property selectionEnd threw an exception.


Sep 13 21:21:35 computer-di-steve [0x0-0x13013].com.google.Chrome[241]: [278:138499:0913/212135:ERROR:v8_value_converter_impl.cc(387)] Getter for property selectionStart threw an exception.


Sep 13 21:21:35 computer-di-steve [0x0-0x13013].com.google.Chrome[241]: [278:138499:0913/212135:ERROR:v8_value_converter_impl.cc(387)] Getter for property selectionDirection threw an exception.


Sep 13 21:21:35 computer-di-steve [0x0-0x13013].com.google.Chrome[241]: [278:138499:0913/212135:ERROR:v8_value_converter_impl.cc(387)] Getter for property selectionEnd threw an exception.


Sep 13 21:21:35 computer-di-steve [0x0-0x13013].com.google.Chrome[241]: [278:138499:0913/212135:ERROR:v8_value_converter_impl.cc(387)] Getter for property selectionStart threw an exception.


Sep 13 21:21:35 computer-di-steve [0x0-0x13013].com.google.Chrome[241]: [278:138499:0913/212135:ERROR:v8_value_converter_impl.cc(387)] Getter for property selectionDirection threw an exception.


Sep 13 21:21:35 computer-di-steve [0x0-0x13013].com.google.Chrome[241]: [278:138499:0913/212135:ERROR:v8_value_converter_impl.cc(387)] Getter for property selectionEnd threw an exception.


Sep 13 21:21:35 computer-di-steve [0x0-0x13013].com.google.Chrome[241]: [278:138499:0913/212135:ERROR:v8_value_converter_impl.cc(387)] Getter for property selectionStart threw an exception.


Sep 13 21:21:35 computer-di-steve [0x0-0x13013].com.google.Chrome[241]: [278:138499:0913/212135:ERROR:v8_value_converter_impl.cc(387)] Getter for property selectionDirection threw an exception.


Sep 13 21:21:35 computer-di-steve [0x0-0x13013].com.google.Chrome[241]: [278:138499:0913/212135:ERROR:v8_value_converter_impl.cc(387)] Getter for property selectionEnd threw an exception.


Sep 13 21:21:35 computer-di-steve [0x0-0x13013].com.google.Chrome[241]: [278:138499:0913/212135:ERROR:v8_value_converter_impl.cc(387)] Getter for property selectionStart threw an exception.


Sep 13 21:21:35 computer-di-steve [0x0-0x13013].com.google.Chrome[241]: [278:138499:0913/212135:ERROR:v8_value_converter_impl.cc(387)] Getter for property selectionDirection threw an exception.


Sep 13 21:21:35 computer-di-steve [0x0-0x13013].com.google.Chrome[241]: [278:138499:0913/212135:ERROR:v8_value_converter_impl.cc(387)] Getter for property selectionEnd threw an exception.


Sep 13 21:21:35 computer-di-steve [0x0-0x13013].com.google.Chrome[241]: [278:138499:0913/212135:ERROR:v8_value_converter_impl.cc(387)] Getter for property selectionStart threw an exception.


Sep 13 21:21:35 computer-di-steve [0x0-0x13013].com.google.Chrome[241]: [278:138499:0913/212135:ERROR:v8_value_converter_impl.cc(387)] Getter for property selectionDirection threw an exception.


Sep 13 21:21:35 computer-di-steve [0x0-0x13013].com.google.Chrome[241]: [278:138499:0913/212135:ERROR:v8_value_converter_impl.cc(387)] Getter for property selectionEnd threw an exception.


Sep 13 21:21:35 computer-di-steve [0x0-0x13013].com.google.Chrome[241]: [278:138499:0913/212135:ERROR:v8_value_converter_impl.cc(387)] Getter for property selectionStart threw an exception.


Sep 13 21:21:35 computer-di-steve [0x0-0x13013].com.google.Chrome[241]: [278:138499:0913/212135:ERROR:v8_value_converter_impl.cc(387)] Getter for property selectionDirection threw an exception.


Sep 13 21:21:35 computer-di-steve [0x0-0x13013].com.google.Chrome[241]: [278:138499:0913/212135:ERROR:v8_value_converter_impl.cc(387)] Getter for property selectionEnd threw an exception.


Sep 13 21:21:35 computer-di-steve [0x0-0x13013].com.google.Chrome[241]: [278:138499:0913/212135:ERROR:v8_value_converter_impl.cc(387)] Getter for property selectionStart threw an exception.


Sep 13 21:21:35 computer-di-steve [0x0-0x13013].com.google.Chrome[241]: [278:138499:0913/212135:ERROR:v8_value_converter_impl.cc(387)] Getter for property selectionDirection threw an exception.


Sep 13 21:21:35 computer-di-steve [0x0-0x13013].com.google.Chrome[241]: [278:138499:0913/212135:ERROR:v8_value_converter_impl.cc(387)] Getter for property selectionEnd threw an exception.


Sep 13 21:21:35 computer-di-steve [0x0-0x13013].com.google.Chrome[241]: [278:138499:0913/212135:ERROR:v8_value_converter_impl.cc(387)] Getter for property selectionStart threw an exception.


Sep 13 21:21:35 computer-di-steve [0x0-0x13013].com.google.Chrome[241]: [278:138499:0913/212135:ERROR:v8_value_converter_impl.cc(387)] Getter for property selectionDirection threw an exception.


Sep 13 21:21:35 computer-di-steve [0x0-0x13013].com.google.Chrome[241]: [278:138499:0913/212135:ERROR:v8_value_converter_impl.cc(387)] Getter for property selectionEnd threw an exception.


Sep 13 21:21:35 computer-di-steve [0x0-0x13013].com.google.Chrome[241]: [278:138499:0913/212135:ERROR:v8_value_converter_impl.cc(387)] Getter for property selectionStart threw an exception.


Sep 13 21:21:35 computer-di-steve [0x0-0x13013].com.google.Chrome[241]: [278:138499:0913/212135:ERROR:v8_value_converter_impl.cc(387)] Getter for property selectionDirection threw an exception.


Sep 13 21:21:35 computer-di-steve [0x0-0x13013].com.google.Chrome[241]: [278:138499:0913/212135:ERROR:v8_value_converter_impl.cc(387)] Getter for property selectionEnd threw an exception.


Sep 13 21:21:35 computer-di-steve [0x0-0x13013].com.google.Chrome[241]: [278:138499:0913/212135:ERROR:v8_value_converter_impl.cc(387)] Getter for property selectionStart threw an exception.


Sep 13 21:21:35 computer-di-steve [0x0-0x13013].com.google.Chrome[241]: [278:138499:0913/212135:ERROR:v8_value_converter_impl.cc(387)] Getter for property selectionDirection threw an exception.


Sep 13 21:21:35 computer-di-steve [0x0-0x13013].com.google.Chrome[241]: [278:138499:0913/212135:ERROR:v8_value_converter_impl.cc(387)] Getter for property selectionEnd threw an exception.


Sep 13 21:21:35 computer-di-steve [0x0-0x13013].com.google.Chrome[241]: [278:138499:0913/212135:ERROR:v8_value_converter_impl.cc(387)] Getter for property selectionStart threw an exception.


Sep 13 21:21:35 computer-di-steve [0x0-0x13013].com.google.Chrome[241]: [278:138499:0913/212135:ERROR:v8_value_converter_impl.cc(387)] Getter for property selectionDirection threw an exception.


Sep 13 21:21:35 computer-di-steve [0x0-0x13013].com.google.Chrome[241]: [278:138499:0913/212135:ERROR:v8_value_converter_impl.cc(387)] Getter for property selectionEnd threw an exception.


Sep 13 21:21:35 computer-di-steve [0x0-0x13013].com.google.Chrome[241]: [278:138499:0913/212135:ERROR:v8_value_converter_impl.cc(387)] Getter for property selectionStart threw an exception.


Sep 13 21:21:35 computer-di-steve [0x0-0x13013].com.google.Chrome[241]: [278:138499:0913/212135:ERROR:v8_value_converter_impl.cc(387)] Getter for property selectionDirection threw an exception.


Sep 13 21:21:35 computer-di-steve [0x0-0x13013].com.google.Chrome[241]: [278:138499:0913/212135:ERROR:v8_value_converter_impl.cc(387)] Getter for property selectionEnd threw an exception.


Sep 13 21:21:35 computer-di-steve [0x0-0x13013].com.google.Chrome[241]: [278:138499:0913/212135:ERROR:v8_value_converter_impl.cc(387)] Getter for property selectionStart threw an exception.


Sep 13 21:21:35 computer-di-steve [0x0-0x13013].com.google.Chrome[241]: [278:138499:0913/212135:ERROR:v8_value_converter_impl.cc(387)] Getter for property selectionDirection threw an exception.


Sep 13 21:21:35 computer-di-steve [0x0-0x13013].com.google.Chrome[241]: [278:138499:0913/212135:ERROR:v8_value_converter_impl.cc(387)] Getter for property selectionEnd threw an exception.


Sep 13 21:21:35 computer-di-steve [0x0-0x13013].com.google.Chrome[241]: [278:138499:0913/212135:ERROR:v8_value_converter_impl.cc(387)] Getter for property selectionStart threw an exception.


Sep 13 21:22:07 computer-di-steve login[302]: USER_PROCESS: 302 ttys000


Sep 13 21:22:11 computer-di-steve [0x0-0x13013].com.google.Chrome[241]: [241:138499:0913/212211:ERROR:audio_manager_base.cc(244)] Invalid audio output parameters received; using fake audio path. Channels: 2, Sample Rate: 0, Bits Per Sample: 16, Frames Per Buffer: 128


Sep 13 21:22:18 computer-di-steve Google Chrome[241]: Cannot find function pointer pluginFactory for factory 053918F4-2869-11D7-A671-000A27E2DB90 in CFBundle/CFPlugIn 0x7d57e270 </Users/Steve/Library/Contextual Menu Items/ToastIt.plugin> (not loaded)


Sep 13 21:22:18 computer-di-steve Google Chrome[241]: Cannot find function pointer dppCMFactoryFunction for factory 32997B62-3E66-11D5-BEAB-003065B300BC in CFBundle/CFPlugIn 0x80a61fc0 </Library/Contextual Menu Items/dppCMPlugIn.plugin> (not loaded)


Sep 13 21:22:18 computer-di-steve Google Chrome[241]: Cannot find function pointer ParallelsCMFactory for factory D92E055E-35BC-4A79-8DAE-9D77EE29DB70 in CFBundle/CFPlugIn 0x80ceaa20 </Library/Contextual Menu Items/ParallelsCM.plugin> (not loaded)


Sep 13 21:22:18 computer-di-steve Google Chrome[241]: Cannot find function pointer MyCMPluginFactory for factory 02E3F072-9CCB-11D5-A0B2-00306575F8A2 in CFBundle/CFPlugIn 0x7d277770 </Library/Contextual Menu Items/StuffItCM.plugin> (not loaded)


Sep 13 21:22:18 computer-di-steve mds[71]: (Warning) Server: No stores registered for metascope "kMDQueryScopeComputer"


Sep 13 21:22:39 computer-di-steve [0x0-0x13013].com.google.Chrome[241]: [241:138499:0913/212239:ERROR:audio_manager_base.cc(244)] Invalid audio output parameters received; using fake audio path. Channels: 2, Sample Rate: 0, Bits Per Sample: 16, Frames Per Buffer: 128


Sep 13 21:22:58 computer-di-steve [0x0-0x13013].com.google.Chrome[241]: [241:138499:0913/212258:ERROR:audio_manager_base.cc(244)] Invalid audio output parameters received; using fake audio path. Channels: 2, Sample Rate: 0, Bits Per Sample: 16, Frames Per Buffer: 128


Sep 13 21:23:12 computer-di-steve Google Chrome[241]: Cannot find function pointer pluginFactory for factory 053918F4-2869-11D7-A671-000A27E2DB90 in CFBundle/CFPlugIn 0x7d57e270 </Users/Steve/Library/Contextual Menu Items/ToastIt.plugin> (not loaded)


Sep 13 21:23:12 computer-di-steve Google Chrome[241]: Cannot find function pointer dppCMFactoryFunction for factory 32997B62-3E66-11D5-BEAB-003065B300BC in CFBundle/CFPlugIn 0x80a61fc0 </Library/Contextual Menu Items/dppCMPlugIn.plugin> (not loaded)


Sep 13 21:23:12 computer-di-steve Google Chrome[241]: Cannot find function pointer ParallelsCMFactory for factory D92E055E-35BC-4A79-8DAE-9D77EE29DB70 in CFBundle/CFPlugIn 0x80ceaa20 </Library/Contextual Menu Items/ParallelsCM.plugin> (not loaded)


Sep 13 21:23:12 computer-di-steve Google Chrome[241]: Cannot find function pointer MyCMPluginFactory for factory 02E3F072-9CCB-11D5-A0B2-00306575F8A2 in CFBundle/CFPlugIn 0x7d277770 </Library/Contextual Menu Items/StuffItCM.plugin> (not loaded)


Sep 13 21:23:13 computer-di-steve Google Chrome[241]: Cannot find function pointer pluginFactory for factory 053918F4-2869-11D7-A671-000A27E2DB90 in CFBundle/CFPlugIn 0x7d57e270 </Users/Steve/Library/Contextual Menu Items/ToastIt.plugin> (not loaded)


Sep 13 21:23:13 computer-di-steve Google Chrome[241]: Cannot find function pointer dppCMFactoryFunction for factory 32997B62-3E66-11D5-BEAB-003065B300BC in CFBundle/CFPlugIn 0x80a61fc0 </Library/Contextual Menu Items/dppCMPlugIn.plugin> (not loaded)


Sep 13 21:23:13 computer-di-steve Google Chrome[241]: Cannot find function pointer ParallelsCMFactory for factory D92E055E-35BC-4A79-8DAE-9D77EE29DB70 in CFBundle/CFPlugIn 0x80ceaa20 </Library/Contextual Menu Items/ParallelsCM.plugin> (not loaded)


Sep 13 21:23:13 computer-di-steve Google Chrome[241]: Cannot find function pointer MyCMPluginFactory for factory 02E3F072-9CCB-11D5-A0B2-00306575F8A2 in CFBundle/CFPlugIn 0x7d277770 </Library/Contextual Menu Items/StuffItCM.plugin> (not loaded)


Sep 13 21:23:47 computer-di-steve [0x0-0x13013].com.google.Chrome[241]: [241:138499:0913/212347:ERROR:audio_manager_base.cc(244)] Invalid audio output parameters received; using fake audio path. Channels: 2, Sample Rate: 0, Bits Per Sample: 16, Frames Per Buffer: 128


Sep 13 21:25:14 computer-di-steve DashboardClient[317]: error [1001] setting colorSpace to iMac colorspace


Sep 13 21:25:14 computer-di-steve com.apple.Dock.agent[184]: 2013-09-13 21:25:14.956 DashboardClient[317:9503] error [1001] setting colorSpace to iMac colorspace


Sep 13 21:25:15 computer-di-steve DashboardClient[317]: error [1001] setting colorSpace to iMac colorspace


Sep 13 21:25:15 computer-di-steve com.apple.Dock.agent[184]: 2013-09-13 21:25:15.017 DashboardClient[317:9503] error [1001] setting colorSpace to iMac colorspace


Sep 13 21:26:02 computer-di-steve AOSN[210]: XMPP session not connected - no ping sent


Sep 13 21:26:35 computer-di-steve [0x0-0x13013].com.google.Chrome[241]: [241:138499:0913/212635:ERROR:audio_manager_base.cc(244)] Invalid audio output parameters received; using fake audio path. Channels: 2, Sample Rate: 0, Bits Per Sample: 16, Frames Per Buffer: 128


Sep 13 21:26:49 computer-di-steve login[302]: DEAD_PROCESS: 302 ttys000


Sep 13 21:27:04 computer-di-steve [0x0-0x13013].com.google.Chrome[241]: [241:138499:0913/212704:ERROR:audio_manager_base.cc(244)] Invalid audio output parameters received; using fake audio path. Channels: 2, Sample Rate: 0, Bits Per Sample: 16, Frames Per Buffer: 128


Sep 13 21:27:50 computer-di-steve [0x0-0x13013].com.google.Chrome[241]: [241:138499:0913/212750:ERROR:audio_manager_base.cc(244)] Invalid audio output parameters received; using fake audio path. Channels: 2, Sample Rate: 0, Bits Per Sample: 16, Frames Per Buffer: 128


Sep 13 21:28:12 computer-di-steve [0x0-0x13013].com.google.Chrome[241]: [335:138499:0913/212812:ERROR:v8_value_converter_impl.cc(387)] Getter for property selectionDirection threw an exception.


Sep 13 21:28:12 computer-di-steve [0x0-0x13013].com.google.Chrome[241]: [335:138499:0913/212812:ERROR:v8_value_converter_impl.cc(387)] Getter for property selectionEnd threw an exception.


Sep 13 21:28:12 computer-di-steve [0x0-0x13013].com.google.Chrome[241]: [335:138499:0913/212812:ERROR:v8_value_converter_impl.cc(387)] Getter for property selectionStart threw an exception.


Sep 13 21:28:12 computer-di-steve [0x0-0x13013].com.google.Chrome[241]: [335:138499:0913/212812:ERROR:v8_value_converter_impl.cc(387)] Getter for property selectionDirection threw an exception.


Sep 13 21:28:12 computer-di-steve [0x0-0x13013].com.google.Chrome[241]: [335:138499:0913/212812:ERROR:v8_value_converter_impl.cc(387)] Getter for property selectionEnd threw an exception.


Sep 13 21:28:12 computer-di-steve [0x0-0x13013].com.google.Chrome[241]: [335:138499:0913/212812:ERROR:v8_value_converter_impl.cc(387)] Getter for property selectionStart threw an exception.


Sep 13 21:28:12 computer-di-steve [0x0-0x13013].com.google.Chrome[241]: [335:138499:0913/212812:ERROR:v8_value_converter_impl.cc(387)] Getter for property selectionDirection threw an exception.


Sep 13 21:28:12 computer-di-steve [0x0-0x13013].com.google.Chrome[241]: [335:138499:0913/212812:ERROR:v8_value_converter_impl.cc(387)] Getter for property selectionEnd threw an exception.


Sep 13 21:28:12 computer-di-steve [0x0-0x13013].com.google.Chrome[241]: [335:138499:0913/212812:ERROR:v8_value_converter_impl.cc(387)] Getter for property selectionStart threw an exception.


Sep 13 21:28:12 computer-di-steve [0x0-0x13013].com.google.Chrome[241]: [335:138499:0913/212812:ERROR:v8_value_converter_impl.cc(387)] Getter for property selectionDirection threw an exception.


Sep 13 21:28:12 computer-di-steve [0x0-0x13013].com.google.Chrome[241]: [335:138499:0913/212812:ERROR:v8_value_converter_impl.cc(387)] Getter for property selectionEnd threw an exception.


Sep 13 21:28:12 computer-di-steve [0x0-0x13013].com.google.Chrome[241]: [335:138499:0913/212812:ERROR:v8_value_converter_impl.cc(387)] Getter for property selectionStart threw an exception.


Sep 13 21:28:12 computer-di-steve [0x0-0x13013].com.google.Chrome[241]: [335:138499:0913/212812:ERROR:v8_value_converter_impl.cc(387)] Getter for property selectionDirection threw an exception.


Sep 13 21:28:12 computer-di-steve [0x0-0x13013].com.google.Chrome[241]: [335:138499:0913/212812:ERROR:v8_value_converter_impl.cc(387)] Getter for property selectionEnd threw an exception.


Sep 13 21:28:12 computer-di-steve [0x0-0x13013].com.google.Chrome[241]: [335:138499:0913/212812:ERROR:v8_value_converter_impl.cc(387)] Getter for property selectionStart threw an exception.


Sep 13 21:28:12 computer-di-steve [0x0-0x13013].com.google.Chrome[241]: [335:138499:0913/212812:ERROR:v8_value_converter_impl.cc(387)] Getter for property selectionDirection threw an exception.


Sep 13 21:28:12 computer-di-steve [0x0-0x13013].com.google.Chrome[241]: [335:138499:0913/212812:ERROR:v8_value_converter_impl.cc(387)] Getter for property selectionEnd threw an exception.


Sep 13 21:28:12 computer-di-steve [0x0-0x13013].com.google.Chrome[241]: [335:138499:0913/212812:ERROR:v8_value_converter_impl.cc(387)] Getter for property selectionStart threw an exception.


Sep 13 21:28:12 computer-di-steve [0x0-0x13013].com.google.Chrome[241]: [335:138499:0913/212812:ERROR:v8_value_converter_impl.cc(387)] Getter for property selectionDirection threw an exception.


Sep 13 21:28:12 computer-di-steve [0x0-0x13013].com.google.Chrome[241]: [335:138499:0913/212812:ERROR:v8_value_converter_impl.cc(387)] Getter for property selectionEnd threw an exception.


Sep 13 21:28:12 computer-di-steve [0x0-0x13013].com.google.Chrome[241]: [335:138499:0913/212812:ERROR:v8_value_converter_impl.cc(387)] Getter for property selectionStart threw an exception.


Sep 13 21:28:12 computer-di-steve [0x0-0x13013].com.google.Chrome[241]: [335:138499:0913/212812:ERROR:v8_value_converter_impl.cc(387)] Getter for property selectionDirection threw an exception.


Sep 13 21:28:12 computer-di-steve [0x0-0x13013].com.google.Chrome[241]: [335:138499:0913/212812:ERROR:v8_value_converter_impl.cc(387)] Getter for property selectionEnd threw an exception.


Sep 13 21:28:12 computer-di-steve [0x0-0x13013].com.google.Chrome[241]: [335:138499:0913/212812:ERROR:v8_value_converter_impl.cc(387)] Getter for property selectionStart threw an exception.


Sep 13 21:28:12 computer-di-steve [0x0-0x13013].com.google.Chrome[241]: [335:138499:0913/212812:ERROR:v8_value_converter_impl.cc(387)] Getter for property selectionDirection threw an exception.


Sep 13 21:28:12 computer-di-steve [0x0-0x13013].com.google.Chrome[241]: [335:138499:0913/212812:ERROR:v8_value_converter_impl.cc(387)] Getter for property selectionEnd threw an exception.


Sep 13 21:28:12 computer-di-steve [0x0-0x13013].com.google.Chrome[241]: [335:138499:0913/212812:ERROR:v8_value_converter_impl.cc(387)] Getter for property selectionStart threw an exception.


Sep 13 21:28:12 computer-di-steve [0x0-0x13013].com.google.Chrome[241]: [335:138499:0913/212812:ERROR:v8_value_converter_impl.cc(387)] Getter for property selectionDirection threw an exception.


Sep 13 21:28:12 computer-di-steve [0x0-0x13013].com.google.Chrome[241]: [335:138499:0913/212812:ERROR:v8_value_converter_impl.cc(387)] Getter for property selectionEnd threw an exception.


Sep 13 21:28:12 computer-di-steve [0x0-0x13013].com.google.Chrome[241]: [335:138499:0913/212812:ERROR:v8_value_converter_impl.cc(387)] Getter for property selectionStart threw an exception.


Sep 13 21:28:12 computer-di-steve [0x0-0x13013].com.google.Chrome[241]: [335:138499:0913/212812:ERROR:v8_value_converter_impl.cc(387)] Getter for property selectionDirection threw an exception.


Sep 13 21:28:12 computer-di-steve [0x0-0x13013].com.google.Chrome[241]: [335:138499:0913/212812:ERROR:v8_value_converter_impl.cc(387)] Getter for property selectionEnd threw an exception.


Sep 13 21:28:12 computer-di-steve [0x0-0x13013].com.google.Chrome[241]: [335:138499:0913/212812:ERROR:v8_value_converter_impl.cc(387)] Getter for property selectionStart threw an exception.


Sep 13 21:28:12 computer-di-steve [0x0-0x13013].com.google.Chrome[241]: [335:138499:0913/212812:ERROR:v8_value_converter_impl.cc(387)] Getter for property selectionDirection threw an exception.


Sep 13 21:28:12 computer-di-steve [0x0-0x13013].com.google.Chrome[241]: [335:138499:0913/212812:ERROR:v8_value_converter_impl.cc(387)] Getter for property selectionEnd threw an exception.


Sep 13 21:28:12 computer-di-steve [0x0-0x13013].com.google.Chrome[241]: [335:138499:0913/212812:ERROR:v8_value_converter_impl.cc(387)] Getter for property selectionStart threw an exception.


Sep 13 21:28:12 computer-di-steve [0x0-0x13013].com.google.Chrome[241]: [335:138499:0913/212812:ERROR:v8_value_converter_impl.cc(387)] Getter for property selectionDirection threw an exception.


Sep 13 21:28:12 computer-di-steve [0x0-0x13013].com.google.Chrome[241]: [335:138499:0913/212812:ERROR:v8_value_converter_impl.cc(387)] Getter for property selectionEnd threw an exception.


Sep 13 21:28:12 computer-di-steve [0x0-0x13013].com.google.Chrome[241]: [335:138499:0913/212812:ERROR:v8_value_converter_impl.cc(387)] Getter for property selectionStart threw an exception.


Sep 13 21:28:12 computer-di-steve [0x0-0x13013].com.google.Chrome[241]: [335:138499:0913/212812:ERROR:v8_value_converter_impl.cc(387)] Getter for property selectionDirection threw an exception.


Sep 13 21:28:12 computer-di-steve [0x0-0x13013].com.google.Chrome[241]: [335:138499:0913/212812:ERROR:v8_value_converter_impl.cc(387)] Getter for property selectionEnd threw an exception.


Sep 13 21:28:12 computer-di-steve [0x0-0x13013].com.google.Chrome[241]: [335:138499:0913/212812:ERROR:v8_value_converter_impl.cc(387)] Getter for property selectionStart threw an exception.


Sep 13 21:28:12 computer-di-steve [0x0-0x13013].com.google.Chrome[241]: [335:138499:0913/212812:ERROR:v8_value_converter_impl.cc(387)] Getter for property selectionDirection threw an exception.


Sep 13 21:28:12 computer-di-steve [0x0-0x13013].com.google.Chrome[241]: [335:138499:0913/212812:ERROR:v8_value_converter_impl.cc(387)] Getter for property selectionEnd threw an exception.


Sep 13 21:28:12 computer-di-steve [0x0-0x13013].com.google.Chrome[241]: [335:138499:0913/212812:ERROR:v8_value_converter_impl.cc(387)] Getter for property selectionStart threw an exception.


Sep 13 21:28:12 computer-di-steve [0x0-0x13013].com.google.Chrome[241]: [335:138499:0913/212812:ERROR:v8_value_converter_impl.cc(387)] Getter for property selectionDirection threw an exception.


Sep 13 21:28:12 computer-di-steve [0x0-0x13013].com.google.Chrome[241]: [335:138499:0913/212812:ERROR:v8_value_converter_impl.cc(387)] Getter for property selectionEnd threw an exception.


Sep 13 21:28:12 computer-di-steve [0x0-0x13013].com.google.Chrome[241]: [335:138499:0913/212812:ERROR:v8_value_converter_impl.cc(387)] Getter for property selectionStart threw an exception.


Sep 13 21:28:12 computer-di-steve [0x0-0x13013].com.google.Chrome[241]: [335:138499:0913/212812:ERROR:v8_value_converter_impl.cc(387)] Getter for property selectionDirection threw an exception.


Sep 13 21:28:12 computer-di-steve [0x0-0x13013].com.google.Chrome[241]: [335:138499:0913/212812:ERROR:v8_value_converter_impl.cc(387)] Getter for property selectionEnd threw an exception.


Sep 13 21:28:12 computer-di-steve [0x0-0x13013].com.google.Chrome[241]: [335:138499:0913/212812:ERROR:v8_value_converter_impl.cc(387)] Getter for property selectionStart threw an exception.


Sep 13 21:28:12 computer-di-steve [0x0-0x13013].com.google.Chrome[241]: [335:138499:0913/212812:ERROR:v8_value_converter_impl.cc(387)] Getter for property selectionDirection threw an exception.


Sep 13 21:28:12 computer-di-steve [0x0-0x13013].com.google.Chrome[241]: [335:138499:0913/212812:ERROR:v8_value_converter_impl.cc(387)] Getter for property selectionEnd threw an exception.


Sep 13 21:28:12 computer-di-steve [0x0-0x13013].com.google.Chrome[241]: [335:138499:0913/212812:ERROR:v8_value_converter_impl.cc(387)] Getter for property selectionStart threw an exception.


Sep 13 21:28:12 computer-di-steve [0x0-0x13013].com.google.Chrome[241]: [335:138499:0913/212812:ERROR:v8_value_converter_impl.cc(387)] Getter for property selectionDirection threw an exception.


Sep 13 21:28:12 computer-di-steve [0x0-0x13013].com.google.Chrome[241]: [335:138499:0913/212812:ERROR:v8_value_converter_impl.cc(387)] Getter for property selectionEnd threw an exception.


Sep 13 21:28:12 computer-di-steve [0x0-0x13013].com.google.Chrome[241]: [335:138499:0913/212812:ERROR:v8_value_converter_impl.cc(387)] Getter for property selectionStart threw an exception.


Sep 13 21:28:54 computer-di-steve [0x0-0x13013].com.google.Chrome[241]: [241:138499:0913/212854:ERROR:audio_manager_base.cc(244)] Invalid audio output parameters received; using fake audio path. Channels: 2, Sample Rate: 0, Bits Per Sample: 16, Frames Per Buffer: 128


Sep 13 21:29:09 computer-di-steve Google Chrome[241]: Cannot find function pointer pluginFactory for factory 053918F4-2869-11D7-A671-000A27E2DB90 in CFBundle/CFPlugIn 0x7d57e270 </Users/Steve/Library/Contextual Menu Items/ToastIt.plugin> (not loaded)


Sep 13 21:29:09 computer-di-steve Google Chrome[241]: Cannot find function pointer dppCMFactoryFunction for factory 32997B62-3E66-11D5-BEAB-003065B300BC in CFBundle/CFPlugIn 0x80a61fc0 </Library/Contextual Menu Items/dppCMPlugIn.plugin> (not loaded)


Sep 13 21:29:09 computer-di-steve Google Chrome[241]: Cannot find function pointer ParallelsCMFactory for factory D92E055E-35BC-4A79-8DAE-9D77EE29DB70 in CFBundle/CFPlugIn 0x80ceaa20 </Library/Contextual Menu Items/ParallelsCM.plugin> (not loaded)


Sep 13 21:29:09 computer-di-steve Google Chrome[241]: Cannot find function pointer MyCMPluginFactory for factory 02E3F072-9CCB-11D5-A0B2-00306575F8A2 in CFBundle/CFPlugIn 0x7d277770 </Library/Contextual Menu Items/StuffItCM.plugin> (not loaded)


Share this post


Link to post
Share on other sites

Sep 13 21:30:15 computer-di-steve mds[71]: (Warning) Server: No stores registered for metascope "kMDQueryScopeComputer"


Sep 13 21:30:26: --- last message repeated 9 times ---


Sep 13 21:30:26 computer-di-steve System Preferences[388]: kCGErrorIllegalArgument: CGSDeviceCreate: Invalid window


Sep 13 21:30:26 computer-di-steve System Preferences[388]: kCGErrorFailure: Set a breakpoint @ CGErrorBreakpoint() to catch errors as they are logged.


Sep 13 21:30:26 computer-di-steve System Preferences[388]: Failed to create window context device


Sep 13 21:30:26 computer-di-steve System Preferences[388]: CGWindowContextCreate: failed to create window context delegate.


Sep 13 21:30:26 computer-di-steve [0x0-0x44044].com.apple.systempreferences[388]: Sep 13 21:30:26 computer-di-steve.local System Preferences[388] <Error>: Failed to create window context device


Sep 13 21:30:26 computer-di-steve [0x0-0x44044].com.apple.systempreferences[388]: Sep 13 21:30:26 computer-di-steve.local System Preferences[388] <Error>: CGWindowContextCreate: failed to create window context delegate.


Sep 13 21:30:26 computer-di-steve System Preferences[388]: _initWithWindowNumber: error creating graphics ctxt object for ctxt:0x1864f, window:0x0


Sep 13 21:30:26 computer-di-steve System Preferences[388]: CGPixelAccessLock failed!


Sep 13 21:30:27 computer-di-steve [0x0-0x13013].com.google.Chrome[241]: [241:138499:0913/213027:ERROR:audio_manager_base.cc(244)] Invalid audio output parameters received; using fake audio path. Channels: 2, Sample Rate: 0, Bits Per Sample: 16, Frames Per Buffer: 128


Sep 13 21:30:56 computer-di-steve [0x0-0x13013].com.google.Chrome[241]: [241:138499:0913/213056:ERROR:audio_manager_base.cc(244)] Invalid audio output parameters received; using fake audio path. Channels: 2, Sample Rate: 0, Bits Per Sample: 16, Frames Per Buffer: 128


Sep 13 21:31:03 computer-di-steve [0x0-0x13013].com.google.Chrome[241]: [395:138499:0913/213103:ERROR:v8_value_converter_impl.cc(387)] Getter for property selectionDirection threw an exception.


Sep 13 21:31:03 computer-di-steve [0x0-0x13013].com.google.Chrome[241]: [395:138499:0913/213103:ERROR:v8_value_converter_impl.cc(387)] Getter for property selectionEnd threw an exception.


Sep 13 21:31:03 computer-di-steve [0x0-0x13013].com.google.Chrome[241]: [395:138499:0913/213103:ERROR:v8_value_converter_impl.cc(387)] Getter for property selectionStart threw an exception.


Sep 13 21:31:03 computer-di-steve [0x0-0x13013].com.google.Chrome[241]: [395:138499:0913/213103:ERROR:v8_value_converter_impl.cc(387)] Getter for property selectionDirection threw an exception.


Sep 13 21:31:03 computer-di-steve [0x0-0x13013].com.google.Chrome[241]: [395:138499:0913/213103:ERROR:v8_value_converter_impl.cc(387)] Getter for property selectionEnd threw an exception.


Sep 13 21:31:03 computer-di-steve [0x0-0x13013].com.google.Chrome[241]: [395:138499:0913/213103:ERROR:v8_value_converter_impl.cc(387)] Getter for property selectionStart threw an exception.


Sep 13 21:31:03 computer-di-steve [0x0-0x13013].com.google.Chrome[241]: [395:138499:0913/213103:ERROR:v8_value_converter_impl.cc(387)] Getter for property selectionDirection threw an exception.


Sep 13 21:31:03 computer-di-steve [0x0-0x13013].com.google.Chrome[241]: [395:138499:0913/213103:ERROR:v8_value_converter_impl.cc(387)] Getter for property selectionEnd threw an exception.


Sep 13 21:31:03 computer-di-steve [0x0-0x13013].com.google.Chrome[241]: [395:138499:0913/213103:ERROR:v8_value_converter_impl.cc(387)] Getter for property selectionStart threw an exception.


Sep 13 21:31:03 computer-di-steve [0x0-0x13013].com.google.Chrome[241]: [395:138499:0913/213103:ERROR:v8_value_converter_impl.cc(387)] Getter for property selectionDirection threw an exception.


Sep 13 21:31:03 computer-di-steve [0x0-0x13013].com.google.Chrome[241]: [395:138499:0913/213103:ERROR:v8_value_converter_impl.cc(387)] Getter for property selectionEnd threw an exception.


Sep 13 21:31:03 computer-di-steve [0x0-0x13013].com.google.Chrome[241]: [395:138499:0913/213103:ERROR:v8_value_converter_impl.cc(387)] Getter for property selectionStart threw an exception.


Sep 13 21:31:03 computer-di-steve [0x0-0x13013].com.google.Chrome[241]: [395:138499:0913/213103:ERROR:v8_value_converter_impl.cc(387)] Getter for property selectionDirection threw an exception.


Sep 13 21:31:03 computer-di-steve [0x0-0x13013].com.google.Chrome[241]: [395:138499:0913/213103:ERROR:v8_value_converter_impl.cc(387)] Getter for property selectionEnd threw an exception.


Sep 13 21:31:03 computer-di-steve [0x0-0x13013].com.google.Chrome[241]: [395:138499:0913/213103:ERROR:v8_value_converter_impl.cc(387)] Getter for property selectionStart threw an exception.


Sep 13 21:31:03 computer-di-steve [0x0-0x13013].com.google.Chrome[241]: [395:138499:0913/213103:ERROR:v8_value_converter_impl.cc(387)] Getter for property selectionDirection threw an exception.


Sep 13 21:31:03 computer-di-steve [0x0-0x13013].com.google.Chrome[241]: [395:138499:0913/213103:ERROR:v8_value_converter_impl.cc(387)] Getter for property selectionEnd threw an exception.


Sep 13 21:31:03 computer-di-steve [0x0-0x13013].com.google.Chrome[241]: [395:138499:0913/213103:ERROR:v8_value_converter_impl.cc(387)] Getter for property selectionStart threw an exception.


Sep 13 21:31:03 computer-di-steve [0x0-0x13013].com.google.Chrome[241]: [395:138499:0913/213103:ERROR:v8_value_converter_impl.cc(387)] Getter for property selectionDirection threw an exception.


Sep 13 21:31:03 computer-di-steve [0x0-0x13013].com.google.Chrome[241]: [395:138499:0913/213103:ERROR:v8_value_converter_impl.cc(387)] Getter for property selectionEnd threw an exception.


Sep 13 21:31:03 computer-di-steve [0x0-0x13013].com.google.Chrome[241]: [395:138499:0913/213103:ERROR:v8_value_converter_impl.cc(387)] Getter for property selectionStart threw an exception.


Sep 13 21:31:03 computer-di-steve [0x0-0x13013].com.google.Chrome[241]: [395:138499:0913/213103:ERROR:v8_value_converter_impl.cc(387)] Getter for property selectionDirection threw an exception.


Sep 13 21:31:03 computer-di-steve [0x0-0x13013].com.google.Chrome[241]: [395:138499:0913/213103:ERROR:v8_value_converter_impl.cc(387)] Getter for property selectionEnd threw an exception.


Sep 13 21:31:03 computer-di-steve [0x0-0x13013].com.google.Chrome[241]: [395:138499:0913/213103:ERROR:v8_value_converter_impl.cc(387)] Getter for property selectionStart threw an exception.


Sep 13 21:31:03 computer-di-steve [0x0-0x13013].com.google.Chrome[241]: [395:138499:0913/213103:ERROR:v8_value_converter_impl.cc(387)] Getter for property selectionDirection threw an exception.


Sep 13 21:31:03 computer-di-steve [0x0-0x13013].com.google.Chrome[241]: [395:138499:0913/213103:ERROR:v8_value_converter_impl.cc(387)] Getter for property selectionEnd threw an exception.


Sep 13 21:31:03 computer-di-steve [0x0-0x13013].com.google.Chrome[241]: [395:138499:0913/213103:ERROR:v8_value_converter_impl.cc(387)] Getter for property selectionStart threw an exception.


Sep 13 21:31:03 computer-di-steve [0x0-0x13013].com.google.Chrome[241]: [395:138499:0913/213103:ERROR:v8_value_converter_impl.cc(387)] Getter for property selectionDirection threw an exception.


Sep 13 21:31:03 computer-di-steve [0x0-0x13013].com.google.Chrome[241]: [395:138499:0913/213103:ERROR:v8_value_converter_impl.cc(387)] Getter for property selectionEnd threw an exception.


Sep 13 21:31:03 computer-di-steve [0x0-0x13013].com.google.Chrome[241]: [395:138499:0913/213103:ERROR:v8_value_converter_impl.cc(387)] Getter for property selectionStart threw an exception.


Sep 13 21:31:03 computer-di-steve [0x0-0x13013].com.google.Chrome[241]: [395:138499:0913/213103:ERROR:v8_value_converter_impl.cc(387)] Getter for property selectionDirection threw an exception.


Sep 13 21:31:03 computer-di-steve [0x0-0x13013].com.google.Chrome[241]: [395:138499:0913/213103:ERROR:v8_value_converter_impl.cc(387)] Getter for property selectionEnd threw an exception.


Sep 13 21:31:03 computer-di-steve [0x0-0x13013].com.google.Chrome[241]: [395:138499:0913/213103:ERROR:v8_value_converter_impl.cc(387)] Getter for property selectionStart threw an exception.


Sep 13 21:31:03 computer-di-steve [0x0-0x13013].com.google.Chrome[241]: [395:138499:0913/213103:ERROR:v8_value_converter_impl.cc(387)] Getter for property selectionDirection threw an exception.


Sep 13 21:31:03 computer-di-steve [0x0-0x13013].com.google.Chrome[241]: [395:138499:0913/213103:ERROR:v8_value_converter_impl.cc(387)] Getter for property selectionEnd threw an exception.


Sep 13 21:31:03 computer-di-steve [0x0-0x13013].com.google.Chrome[241]: [395:138499:0913/213103:ERROR:v8_value_converter_impl.cc(387)] Getter for property selectionStart threw an exception.


Sep 13 21:31:03 computer-di-steve [0x0-0x13013].com.google.Chrome[241]: [395:138499:0913/213103:ERROR:v8_value_converter_impl.cc(387)] Getter for property selectionDirection threw an exception.


Sep 13 21:31:03 computer-di-steve [0x0-0x13013].com.google.Chrome[241]: [395:138499:0913/213103:ERROR:v8_value_converter_impl.cc(387)] Getter for property selectionEnd threw an exception.


Sep 13 21:31:03 computer-di-steve [0x0-0x13013].com.google.Chrome[241]: [395:138499:0913/213103:ERROR:v8_value_converter_impl.cc(387)] Getter for property selectionStart threw an exception.


Sep 13 21:31:13 computer-di-steve [0x0-0x13013].com.google.Chrome[241]: [397:138499:0913/213113:ERROR:v8_value_converter_impl.cc(387)] Getter for property selectionDirection threw an exception.


Sep 13 21:31:13 computer-di-steve [0x0-0x13013].com.google.Chrome[241]: [397:138499:0913/213113:ERROR:v8_value_converter_impl.cc(387)] Getter for property selectionEnd threw an exception.


Sep 13 21:31:13 computer-di-steve [0x0-0x13013].com.google.Chrome[241]: [397:138499:0913/213113:ERROR:v8_value_converter_impl.cc(387)] Getter for property selectionStart threw an exception.


Sep 13 21:31:13 computer-di-steve [0x0-0x13013].com.google.Chrome[241]: [397:138499:0913/213113:ERROR:v8_value_converter_impl.cc(387)] Getter for property selectionDirection threw an exception.


Sep 13 21:31:13 computer-di-steve [0x0-0x13013].com.google.Chrome[241]: [397:138499:0913/213113:ERROR:v8_value_converter_impl.cc(387)] Getter for property selectionEnd threw an exception.


Sep 13 21:31:13 computer-di-steve [0x0-0x13013].com.google.Chrome[241]: [397:138499:0913/213113:ERROR:v8_value_converter_impl.cc(387)] Getter for property selectionStart threw an exception.


Sep 13 21:31:13 computer-di-steve [0x0-0x13013].com.google.Chrome[241]: [397:138499:0913/213113:ERROR:v8_value_converter_impl.cc(387)] Getter for property selectionDirection threw an exception.


Sep 13 21:31:13 computer-di-steve [0x0-0x13013].com.google.Chrome[241]: [397:138499:0913/213113:ERROR:v8_value_converter_impl.cc(387)] Getter for property selectionEnd threw an exception.


Sep 13 21:31:13 computer-di-steve [0x0-0x13013].com.google.Chrome[241]: [397:138499:0913/213113:ERROR:v8_value_converter_impl.cc(387)] Getter for property selectionStart threw an exception.


Sep 13 21:31:13 computer-di-steve [0x0-0x13013].com.google.Chrome[241]: [397:138499:0913/213113:ERROR:v8_value_converter_impl.cc(387)] Getter for property selectionDirection threw an exception.


Sep 13 21:31:13 computer-di-steve [0x0-0x13013].com.google.Chrome[241]: [397:138499:0913/213113:ERROR:v8_value_converter_impl.cc(387)] Getter for property selectionEnd threw an exception.


Sep 13 21:31:13 computer-di-steve [0x0-0x13013].com.google.Chrome[241]: [397:138499:0913/213113:ERROR:v8_value_converter_impl.cc(387)] Getter for property selectionStart threw an exception.


Sep 13 21:31:13 computer-di-steve [0x0-0x13013].com.google.Chrome[241]: [397:138499:0913/213113:ERROR:v8_value_converter_impl.cc(387)] Getter for property selectionDirection threw an exception.


Sep 13 21:31:13 computer-di-steve [0x0-0x13013].com.google.Chrome[241]: [397:138499:0913/213113:ERROR:v8_value_converter_impl.cc(387)] Getter for property selectionEnd threw an exception.


Sep 13 21:31:13 computer-di-steve [0x0-0x13013].com.google.Chrome[241]: [397:138499:0913/213113:ERROR:v8_value_converter_impl.cc(387)] Getter for property selectionStart threw an exception.


Sep 13 21:31:13 computer-di-steve [0x0-0x13013].com.google.Chrome[241]: [397:138499:0913/213113:ERROR:v8_value_converter_impl.cc(387)] Getter for property selectionDirection threw an exception.


Sep 13 21:31:13 computer-di-steve [0x0-0x13013].com.google.Chrome[241]: [397:138499:0913/213113:ERROR:v8_value_converter_impl.cc(387)] Getter for property selectionEnd threw an exception.


Sep 13 21:31:13 computer-di-steve [0x0-0x13013].com.google.Chrome[241]: [397:138499:0913/213113:ERROR:v8_value_converter_impl.cc(387)] Getter for property selectionStart threw an exception.


Sep 13 21:31:13 computer-di-steve [0x0-0x13013].com.google.Chrome[241]: [397:138499:0913/213113:ERROR:v8_value_converter_impl.cc(387)] Getter for property selectionDirection threw an exception.


Sep 13 21:31:13 computer-di-steve [0x0-0x13013].com.google.Chrome[241]: [397:138499:0913/213113:ERROR:v8_value_converter_impl.cc(387)] Getter for property selectionEnd threw an exception.


Sep 13 21:31:13 computer-di-steve [0x0-0x13013].com.google.Chrome[241]: [397:138499:0913/213113:ERROR:v8_value_converter_impl.cc(387)] Getter for property selectionStart threw an exception.


Sep 13 21:31:13 computer-di-steve [0x0-0x13013].com.google.Chrome[241]: [397:138499:0913/213113:ERROR:v8_value_converter_impl.cc(387)] Getter for property selectionDirection threw an exception.


Sep 13 21:31:13 computer-di-steve [0x0-0x13013].com.google.Chrome[241]: [397:138499:0913/213113:ERROR:v8_value_converter_impl.cc(387)] Getter for property selectionEnd threw an exception.


Sep 13 21:31:13 computer-di-steve [0x0-0x13013].com.google.Chrome[241]: [397:138499:0913/213113:ERROR:v8_value_converter_impl.cc(387)] Getter for property selectionStart threw an exception.


Sep 13 21:31:13 computer-di-steve [0x0-0x13013].com.google.Chrome[241]: [397:138499:0913/213113:ERROR:v8_value_converter_impl.cc(387)] Getter for property selectionDirection threw an exception.


Sep 13 21:31:13 computer-di-steve [0x0-0x13013].com.google.Chrome[241]: [397:138499:0913/213113:ERROR:v8_value_converter_impl.cc(387)] Getter for property selectionEnd threw an exception.


Sep 13 21:31:13 computer-di-steve [0x0-0x13013].com.google.Chrome[241]: [397:138499:0913/213113:ERROR:v8_value_converter_impl.cc(387)] Getter for property selectionStart threw an exception.


Sep 13 21:31:14 computer-di-steve [0x0-0x13013].com.google.Chrome[241]: [397:138499:0913/213114:ERROR:v8_value_converter_impl.cc(387)] Getter for property selectionDirection threw an exception.


Sep 13 21:31:14 computer-di-steve [0x0-0x13013].com.google.Chrome[241]: [397:138499:0913/213114:ERROR:v8_value_converter_impl.cc(387)] Getter for property selectionEnd threw an exception.


Sep 13 21:31:14 computer-di-steve [0x0-0x13013].com.google.Chrome[241]: [397:138499:0913/213114:ERROR:v8_value_converter_impl.cc(387)] Getter for property selectionStart threw an exception.


Sep 13 21:32:46 computer-di-steve [0x0-0x13013].com.google.Chrome[241]: [241:138499:0913/213246:ERROR:audio_manager_base.cc(244)] Invalid audio output parameters received; using fake audio path. Channels: 2, Sample Rate: 0, Bits Per Sample: 16, Frames Per Buffer: 128


Sep 13 21:33:38 computer-di-steve [0x0-0x13013].com.google.Chrome[241]: [241:138499:0913/213338:ERROR:audio_manager_base.cc(244)] Invalid audio output parameters received; using fake audio path. Channels: 2, Sample Rate: 0, Bits Per Sample: 16, Frames Per Buffer: 128


Sep 13 21:34:01 computer-di-steve [0x0-0x13013].com.google.Chrome[241]: [241:138499:0913/213401:ERROR:render_widget_host_view_mac.mm(1255)] Failed SetIOSurface on CompositingIOSurfaceMac


Sep 13 21:34:03: --- last message repeated 2 times ---


Sep 13 21:34:03 computer-di-steve [0x0-0x13013].com.google.Chrome[241]: [241:138499:0913/213403:ERROR:audio_manager_base.cc(244)] Invalid audio output parameters received; using fake audio path. Channels: 2, Sample Rate: 0, Bits Per Sample: 16, Frames Per Buffer: 128


Sep 13 21:34:04 computer-di-steve [0x0-0x13013].com.google.Chrome[241]: [401:138499:0913/213404:ERROR:v8_value_converter_impl.cc(387)] Getter for property selectionDirection threw an exception.


Sep 13 21:34:04 computer-di-steve [0x0-0x13013].com.google.Chrome[241]: [401:138499:0913/213404:ERROR:v8_value_converter_impl.cc(387)] Getter for property selectionEnd threw an exception.


Sep 13 21:34:04 computer-di-steve [0x0-0x13013].com.google.Chrome[241]: [401:138499:0913/213404:ERROR:v8_value_converter_impl.cc(387)] Getter for property selectionStart threw an exception.


Sep 13 21:34:04 computer-di-steve [0x0-0x13013].com.google.Chrome[241]: [401:138499:0913/213404:ERROR:v8_value_converter_impl.cc(387)] Getter for property selectionDirection threw an exception.


Sep 13 21:34:04 computer-di-steve [0x0-0x13013].com.google.Chrome[241]: [401:138499:0913/213404:ERROR:v8_value_converter_impl.cc(387)] Getter for property selectionEnd threw an exception.


Sep 13 21:34:04 computer-di-steve [0x0-0x13013].com.google.Chrome[241]: [401:138499:0913/213404:ERROR:v8_value_converter_impl.cc(387)] Getter for property selectionStart threw an exception.


Sep 13 21:34:04 computer-di-steve [0x0-0x13013].com.google.Chrome[241]: [401:138499:0913/213404:ERROR:v8_value_converter_impl.cc(387)] Getter for property selectionDirection threw an exception.


Sep 13 21:34:04 computer-di-steve [0x0-0x13013].com.google.Chrome[241]: [401:138499:0913/213404:ERROR:v8_value_converter_impl.cc(387)] Getter for property selectionEnd threw an exception.


Sep 13 21:34:04 computer-di-steve [0x0-0x13013].com.google.Chrome[241]: [401:138499:0913/213404:ERROR:v8_value_converter_impl.cc(387)] Getter for property selectionStart threw an exception.


Sep 13 21:34:04 computer-di-steve [0x0-0x13013].com.google.Chrome[241]: [401:138499:0913/213404:ERROR:v8_value_converter_impl.cc(387)] Getter for property selectionDirection threw an exception.


Sep 13 21:34:04 computer-di-steve [0x0-0x13013].com.google.Chrome[241]: [401:138499:0913/213404:ERROR:v8_value_converter_impl.cc(387)] Getter for property selectionEnd threw an exception.


Sep 13 21:34:04 computer-di-steve [0x0-0x13013].com.google.Chrome[241]: [401:138499:0913/213404:ERROR:v8_value_converter_impl.cc(387)] Getter for property selectionStart threw an exception.


Sep 13 21:34:04 computer-di-steve [0x0-0x13013].com.google.Chrome[241]: [401:138499:0913/213404:ERROR:v8_value_converter_impl.cc(387)] Getter for property selectionDirection threw an exception.


Sep 13 21:34:04 computer-di-steve [0x0-0x13013].com.google.Chrome[241]: [401:138499:0913/213404:ERROR:v8_value_converter_impl.cc(387)] Getter for property selectionEnd threw an exception.


Sep 13 21:34:04 computer-di-steve [0x0-0x13013].com.google.Chrome[241]: [401:138499:0913/213404:ERROR:v8_value_converter_impl.cc(387)] Getter for property selectionStart threw an exception.


Sep 13 21:34:04 computer-di-steve [0x0-0x13013].com.google.Chrome[241]: [401:138499:0913/213404:ERROR:v8_value_converter_impl.cc(387)] Getter for property selectionDirection threw an exception.


Sep 13 21:34:04 computer-di-steve [0x0-0x13013].com.google.Chrome[241]: [401:138499:0913/213404:ERROR:v8_value_converter_impl.cc(387)] Getter for property selectionEnd threw an exception.


Sep 13 21:34:04 computer-di-steve [0x0-0x13013].com.google.Chrome[241]: [401:138499:0913/213404:ERROR:v8_value_converter_impl.cc(387)] Getter for property selectionStart threw an exception.


Sep 13 21:34:04 computer-di-steve [0x0-0x13013].com.google.Chrome[241]: [401:138499:0913/213404:ERROR:v8_value_converter_impl.cc(387)] Getter for property selectionDirection threw an exception.


Sep 13 21:34:04 computer-di-steve [0x0-0x13013].com.google.Chrome[241]: [401:138499:0913/213404:ERROR:v8_value_converter_impl.cc(387)] Getter for property selectionEnd threw an exception.


Sep 13 21:34:04 computer-di-steve [0x0-0x13013].com.google.Chrome[241]: [401:138499:0913/213404:ERROR:v8_value_converter_impl.cc(387)] Getter for property selectionStart threw an exception.


Sep 13 21:34:04 computer-di-steve [0x0-0x13013].com.google.Chrome[241]: [401:138499:0913/213404:ERROR:v8_value_converter_impl.cc(387)] Getter for property selectionDirection threw an exception.


Sep 13 21:34:04 computer-di-steve [0x0-0x13013].com.google.Chrome[241]: [401:138499:0913/213404:ERROR:v8_value_converter_impl.cc(387)] Getter for property selectionEnd threw an exception.


Sep 13 21:34:04 computer-di-steve [0x0-0x13013].com.google.Chrome[241]: [401:138499:0913/213404:ERROR:v8_value_converter_impl.cc(387)] Getter for property selectionStart threw an exception.


Sep 13 21:34:04 computer-di-steve [0x0-0x13013].com.google.Chrome[241]: [401:138499:0913/213404:ERROR:v8_value_converter_impl.cc(387)] Getter for property selectionDirection threw an exception.


Sep 13 21:34:04 computer-di-steve [0x0-0x13013].com.google.Chrome[241]: [401:138499:0913/213404:ERROR:v8_value_converter_impl.cc(387)] Getter for property selectionEnd threw an exception.


Sep 13 21:34:04 computer-di-steve [0x0-0x13013].com.google.Chrome[241]: [401:138499:0913/213404:ERROR:v8_value_converter_impl.cc(387)] Getter for property selectionStart threw an exception.


Sep 13 21:34:04 computer-di-steve [0x0-0x13013].com.google.Chrome[241]: [401:138499:0913/213404:ERROR:v8_value_converter_impl.cc(387)] Getter for property selectionDirection threw an exception.


Sep 13 21:34:04 computer-di-steve [0x0-0x13013].com.google.Chrome[241]: [401:138499:0913/213404:ERROR:v8_value_converter_impl.cc(387)] Getter for property selectionEnd threw an exception.


Sep 13 21:34:04 computer-di-steve [0x0-0x13013].com.google.Chrome[241]: [401:138499:0913/213404:ERROR:v8_value_converter_impl.cc(387)] Getter for property selectionStart threw an exception.


Sep 13 21:34:04 computer-di-steve [0x0-0x13013].com.google.Chrome[241]: [401:138499:0913/213404:ERROR:v8_value_converter_impl.cc(387)] Getter for property selectionDirection threw an exception.


Sep 13 21:34:04 computer-di-steve [0x0-0x13013].com.google.Chrome[241]: [401:138499:0913/213404:ERROR:v8_value_converter_impl.cc(387)] Getter for property selectionEnd threw an exception.


Sep 13 21:34:04 computer-di-steve [0x0-0x13013].com.google.Chrome[241]: [401:138499:0913/213404:ERROR:v8_value_converter_impl.cc(387)] Getter for property selectionStart threw an exception.


Sep 13 21:34:04 computer-di-steve [0x0-0x13013].com.google.Chrome[241]: [401:138499:0913/213404:ERROR:v8_value_converter_impl.cc(387)] Getter for property selectionDirection threw an exception.


Sep 13 21:34:04 computer-di-steve [0x0-0x13013].com.google.Chrome[241]: [401:138499:0913/213404:ERROR:v8_value_converter_impl.cc(387)] Getter for property selectionEnd threw an exception.


Sep 13 21:34:04 computer-di-steve [0x0-0x13013].com.google.Chrome[241]: [401:138499:0913/213404:ERROR:v8_value_converter_impl.cc(387)] Getter for property selectionStart threw an exception.


Sep 13 21:34:04 computer-di-steve [0x0-0x13013].com.google.Chrome[241]: [401:138499:0913/213404:ERROR:v8_value_converter_impl.cc(387)] Getter for property selectionDirection threw an exception.


Sep 13 21:34:04 computer-di-steve [0x0-0x13013].com.google.Chrome[241]: [401:138499:0913/213404:ERROR:v8_value_converter_impl.cc(387)] Getter for property selectionEnd threw an exception.


Sep 13 21:34:04 computer-di-steve [0x0-0x13013].com.google.Chrome[241]: [401:138499:0913/213404:ERROR:v8_value_converter_impl.cc(387)] Getter for property selectionStart threw an exception.


Sep 13 21:34:13 computer-di-steve [0x0-0x13013].com.google.Chrome[241]: [241:138499:0913/213413:ERROR:render_widget_host_view_mac.mm(1255)] Failed SetIOSurface on CompositingIOSurfaceMac


Sep 13 21:34:15: --- last message repeated 1 time ---


Sep 13 21:34:15 computer-di-steve [0x0-0x13013].com.google.Chrome[241]: [401:138499:0913/213415:ERROR:v8_value_converter_impl.cc(387)] Getter for property selectionDirection threw an exception.


Sep 13 21:34:15 computer-di-steve [0x0-0x13013].com.google.Chrome[241]: [401:138499:0913/213415:ERROR:v8_value_converter_impl.cc(387)] Getter for property selectionEnd threw an exception.


Sep 13 21:34:15 computer-di-steve [0x0-0x13013].com.google.Chrome[241]: [401:138499:0913/213415:ERROR:v8_value_converter_impl.cc(387)] Getter for property selectionStart threw an exception.


Sep 13 21:34:15 computer-di-steve [0x0-0x13013].com.google.Chrome[241]: [401:138499:0913/213415:ERROR:v8_value_converter_impl.cc(387)] Getter for property selectionDirection threw an exception.


Sep 13 21:34:15 computer-di-steve [0x0-0x13013].com.google.Chrome[241]: [401:138499:0913/213415:ERROR:v8_value_converter_impl.cc(387)] Getter for property selectionEnd threw an exception.


Sep 13 21:34:15 computer-di-steve [0x0-0x13013].com.google.Chrome[241]: [401:138499:0913/213415:ERROR:v8_value_converter_impl.cc(387)] Getter for property selectionStart threw an exception.


Sep 13 21:34:15 computer-di-steve [0x0-0x13013].com.google.Chrome[241]: [401:138499:0913/213415:ERROR:v8_value_converter_impl.cc(387)] Getter for property selectionDirection threw an exception.


Sep 13 21:34:15 computer-di-steve [0x0-0x13013].com.google.Chrome[241]: [401:138499:0913/213415:ERROR:v8_value_converter_impl.cc(387)] Getter for property selectionEnd threw an exception.


Sep 13 21:34:15 computer-di-steve [0x0-0x13013].com.google.Chrome[241]: [401:138499:0913/213415:ERROR:v8_value_converter_impl.cc(387)] Getter for property selectionStart threw an exception.


Sep 13 21:34:15 computer-di-steve [0x0-0x13013].com.google.Chrome[241]: [401:138499:0913/213415:ERROR:v8_value_converter_impl.cc(387)] Getter for property selectionDirection threw an exception.


Sep 13 21:34:15 computer-di-steve [0x0-0x13013].com.google.Chrome[241]: [401:138499:0913/213415:ERROR:v8_value_converter_impl.cc(387)] Getter for property selectionEnd threw an exception.


Sep 13 21:34:15 computer-di-steve [0x0-0x13013].com.google.Chrome[241]: [401:138499:0913/213415:ERROR:v8_value_converter_impl.cc(387)] Getter for property selectionStart threw an exception.


Sep 13 21:34:15 computer-di-steve [0x0-0x13013].com.google.Chrome[241]: [401:138499:0913/213415:ERROR:v8_value_converter_impl.cc(387)] Getter for property selectionDirection threw an exception.


Sep 13 21:34:15 computer-di-steve [0x0-0x13013].com.google.Chrome[241]: [401:138499:0913/213415:ERROR:v8_value_converter_impl.cc(387)] Getter for property selectionEnd threw an exception.


Sep 13 21:34:15 computer-di-steve [0x0-0x13013].com.google.Chrome[241]: [401:138499:0913/213415:ERROR:v8_value_converter_impl.cc(387)] Getter for property selectionStart threw an exception.


Sep 13 21:34:15 computer-di-steve [0x0-0x13013].com.google.Chrome[241]: [401:138499:0913/213415:ERROR:v8_value_converter_impl.cc(387)] Getter for property selectionDirection threw an exception.


Sep 13 21:34:15 computer-di-steve [0x0-0x13013].com.google.Chrome[241]: [401:138499:0913/213415:ERROR:v8_value_converter_impl.cc(387)] Getter for property selectionEnd threw an exception.


Sep 13 21:34:15 computer-di-steve [0x0-0x13013].com.google.Chrome[241]: [401:138499:0913/213415:ERROR:v8_value_converter_impl.cc(387)] Getter for property selectionStart threw an exception.


Sep 13 21:34:15 computer-di-steve [0x0-0x13013].com.google.Chrome[241]: [401:138499:0913/213415:ERROR:v8_value_converter_impl.cc(387)] Getter for property selectionDirection threw an exception.


Sep 13 21:34:15 computer-di-steve [0x0-0x13013].com.google.Chrome[241]: [401:138499:0913/213415:ERROR:v8_value_converter_impl.cc(387)] Getter for property selectionEnd threw an exception.


Sep 13 21:34:15 computer-di-steve [0x0-0x13013].com.google.Chrome[241]: [401:138499:0913/213415:ERROR:v8_value_converter_impl.cc(387)] Getter for property selectionStart threw an exception.


Sep 13 21:34:15 computer-di-steve [0x0-0x13013].com.google.Chrome[241]: [401:138499:0913/213415:ERROR:v8_value_converter_impl.cc(387)] Getter for property selectionDirection threw an exception.


Sep 13 21:34:15 computer-di-steve [0x0-0x13013].com.google.Chrome[241]: [401:138499:0913/213415:ERROR:v8_value_converter_impl.cc(387)] Getter for property selectionEnd threw an exception.


Sep 13 21:34:15 computer-di-steve [0x0-0x13013].com.google.Chrome[241]: [401:138499:0913/213415:ERROR:v8_value_converter_impl.cc(387)] Getter for property selectionStart threw an exception.


Sep 13 21:34:15 computer-di-steve [0x0-0x13013].com.google.Chrome[241]: [401:138499:0913/213415:ERROR:v8_value_converter_impl.cc(387)] Getter for property selectionDirection threw an exception.


Sep 13 21:34:15 computer-di-steve [0x0-0x13013].com.google.Chrome[241]: [401:138499:0913/213415:ERROR:v8_value_converter_impl.cc(387)] Getter for property selectionEnd threw an exception.


Sep 13 21:34:15 computer-di-steve [0x0-0x13013].com.google.Chrome[241]: [401:138499:0913/213415:ERROR:v8_value_converter_impl.cc(387)] Getter for property selectionStart threw an exception.


Sep 13 21:34:15 computer-di-steve [0x0-0x13013].com.google.Chrome[241]: [401:138499:0913/213415:ERROR:v8_value_converter_impl.cc(387)] Getter for property selectionDirection threw an exception.


Sep 13 21:34:15 computer-di-steve [0x0-0x13013].com.google.Chrome[241]: [401:138499:0913/213415:ERROR:v8_value_converter_impl.cc(387)] Getter for property selectionEnd threw an exception.


Sep 13 21:34:15 computer-di-steve [0x0-0x13013].com.google.Chrome[241]: [401:138499:0913/213415:ERROR:v8_value_converter_impl.cc(387)] Getter for property selectionStart threw an exception.


Sep 13 21:34:33 computer-di-steve [0x0-0x13013].com.google.Chrome[241]: [401:138499:0913/213433:ERROR:v8_value_converter_impl.cc(387)] Getter for property selectionDirection threw an exception.


Sep 13 21:34:33 computer-di-steve [0x0-0x13013].com.google.Chrome[241]: [401:138499:0913/213433:ERROR:v8_value_converter_impl.cc(387)] Getter for property selectionEnd threw an exception.


Sep 13 21:34:33 computer-di-steve [0x0-0x13013].com.google.Chrome[241]: [401:138499:0913/213433:ERROR:v8_value_converter_impl.cc(387)] Getter for property selectionStart threw an exception.


Sep 13 21:34:33 computer-di-steve [0x0-0x13013].com.google.Chrome[241]: [401:138499:0913/213433:ERROR:v8_value_converter_impl.cc(387)] Getter for property selectionDirection threw an exception.


Sep 13 21:34:33 computer-di-steve [0x0-0x13013].com.google.Chrome[241]: [401:138499:0913/213433:ERROR:v8_value_converter_impl.cc(387)] Getter for property selectionEnd threw an exception.


Sep 13 21:34:33 computer-di-steve [0x0-0x13013].com.google.Chrome[241]: [401:138499:0913/213433:ERROR:v8_value_converter_impl.cc(387)] Getter for property selectionStart threw an exception.


Sep 13 21:34:33 computer-di-steve [0x0-0x13013].com.google.Chrome[241]: [401:138499:0913/213433:ERROR:v8_value_converter_impl.cc(387)] Getter for property selectionDirection threw an exception.


Sep 13 21:34:33 computer-di-steve [0x0-0x13013].com.google.Chrome[241]: [401:138499:0913/213433:ERROR:v8_value_converter_impl.cc(387)] Getter for property selectionEnd threw an exception.


Sep 13 21:34:33 computer-di-steve [0x0-0x13013].com.google.Chrome[241]: [401:138499:0913/213433:ERROR:v8_value_converter_impl.cc(387)] Getter for property selectionStart threw an exception.


Sep 13 21:34:33 computer-di-steve [0x0-0x13013].com.google.Chrome[241]: [401:138499:0913/213433:ERROR:v8_value_converter_impl.cc(387)] Getter for property selectionDirection threw an exception.


Sep 13 21:34:33 computer-di-steve [0x0-0x13013].com.google.Chrome[241]: [401:138499:0913/213433:ERROR:v8_value_converter_impl.cc(387)] Getter for property selectionEnd threw an exception.


Sep 13 21:34:33 computer-di-steve [0x0-0x13013].com.google.Chrome[241]: [401:138499:0913/213433:ERROR:v8_value_converter_impl.cc(387)] Getter for property selectionStart threw an exception.


Sep 13 21:34:33 computer-di-steve [0x0-0x13013].com.google.Chrome[241]: [401:138499:0913/213433:ERROR:v8_value_converter_impl.cc(387)] Getter for property selectionDirection threw an exception.


Sep 13 21:34:33 computer-di-steve [0x0-0x13013].com.google.Chrome[241]: [401:138499:0913/213433:ERROR:v8_value_converter_impl.cc(387)] Getter for property selectionEnd threw an exception.


Sep 13 21:34:33 computer-di-steve [0x0-0x13013].com.google.Chrome[241]: [401:138499:0913/213433:ERROR:v8_value_converter_impl.cc(387)] Getter for property selectionStart threw an exception.


Sep 13 21:34:33 computer-di-steve [0x0-0x13013].com.google.Chrome[241]: [401:138499:0913/213433:ERROR:v8_value_converter_impl.cc(387)] Getter for property selectionDirection threw an exception.


Sep 13 21:34:33 computer-di-steve [0x0-0x13013].com.google.Chrome[241]: [401:138499:0913/213433:ERROR:v8_value_converter_impl.cc(387)] Getter for property selectionEnd threw an exception.


Sep 13 21:34:33 computer-di-steve [0x0-0x13013].com.google.Chrome[241]: [401:138499:0913/213433:ERROR:v8_value_converter_impl.cc(387)] Getter for property selectionStart threw an exception.


Sep 13 21:34:33 computer-di-steve [0x0-0x13013].com.google.Chrome[241]: [401:138499:0913/213433:ERROR:v8_value_converter_impl.cc(387)] Getter for property selectionDirection threw an exception.


Sep 13 21:34:33 computer-di-steve [0x0-0x13013].com.google.Chrome[241]: [401:138499:0913/213433:ERROR:v8_value_converter_impl.cc(387)] Getter for property selectionEnd threw an exception.


Sep 13 21:34:33 computer-di-steve [0x0-0x13013].com.google.Chrome[241]: [401:138499:0913/213433:ERROR:v8_value_converter_impl.cc(387)] Getter for property selectionStart threw an exception.


Sep 13 21:34:50 computer-di-steve Console[402]: Could not find image named 'BackArrow'.


Sep 13 21:34:50 computer-di-steve Console[402]: Could not find image named 'ForwardArrow'.


Sep 13 21:35:00 computer-di-steve [0x0-0x13013].com.google.Chrome[241]: [241:138499:0913/213500:ERROR:audio_manager_base.cc(244)] Invalid audio output parameters received; using fake audio path. Channels: 2, Sample Rate: 0, Bits Per Sample: 16, Frames Per Buffer: 128


Sep 13 21:36:51 computer-di-steve [0x0-0x13013].com.google.Chrome[241]: [241:138499:0913/213651:ERROR:audio_manager_base.cc(244)] Invalid audio output parameters received; using fake audio path. Channels: 2, Sample Rate: 0, Bits Per Sample: 16, Frames Per Buffer: 128


Sep 13 21:37:31 computer-di-steve [0x0-0x13013].com.google.Chrome[241]: [241:138499:0913/213731:ERROR:audio_manager_base.cc(244)] Invalid audio output parameters received; using fake audio path. Channels: 2, Sample Rate: 0, Bits Per Sample: 16, Frames Per Buffer: 128


Sep 13 21:38:24 computer-di-steve [0x0-0x13013].com.google.Chrome[241]: [241:138499:0913/213824:ERROR:audio_manager_base.cc(244)] Invalid audio output parameters received; using fake audio path. Channels: 2, Sample Rate: 0, Bits Per Sample: 16, Frames Per Buffer: 128


Sep 13 21:40:42 computer-di-steve [0x0-0x13013].com.google.Chrome[241]: [241:138499:0913/214042:ERROR:audio_manager_base.cc(244)] Invalid audio output parameters received; using fake audio path. Channels: 2, Sample Rate: 0, Bits Per Sample: 16, Frames Per Buffer: 128


Sep 13 21:42:22 computer-di-steve [0x0-0x13013].com.google.Chrome[241]: [241:138499:0913/214222:ERROR:audio_manager_base.cc(244)] Invalid audio output parameters received; using fake audio path. Channels: 2, Sample Rate: 0, Bits Per Sample: 16, Frames Per Buffer: 128


Sep 13 21:43:36 computer-di-steve [0x0-0x13013].com.google.Chrome[241]: [241:138499:0913/214336:ERROR:audio_manager_base.cc(244)] Invalid audio output parameters received; using fake audio path. Channels: 2, Sample Rate: 0, Bits Per Sample: 16, Frames Per Buffer: 128


Sep 13 21:44:01 computer-di-steve [0x0-0x13013].com.google.Chrome[241]: [241:138499:0913/214401:ERROR:audio_manager_base.cc(244)] Invalid audio output parameters received; using fake audio path. Channels: 2, Sample Rate: 0, Bits Per Sample: 16, Frames Per Buffer: 128


Sep 13 21:44:05 computer-di-steve [0x0-0x13013].com.google.Chrome[241]: [416:138499:0913/214405:ERROR:v8_value_converter_impl.cc(387)] Getter for property selectionDirection threw an exception.


Sep 13 21:44:05 computer-di-steve [0x0-0x13013].com.google.Chrome[241]: [416:138499:0913/214405:ERROR:v8_value_converter_impl.cc(387)] Getter for property selectionEnd threw an exception.


Sep 13 21:44:05 computer-di-steve [0x0-0x13013].com.google.Chrome[241]: [416:138499:0913/214405:ERROR:v8_value_converter_impl.cc(387)] Getter for property selectionStart threw an exception.


Sep 13 21:44:05 computer-di-steve [0x0-0x13013].com.google.Chrome[241]: [416:138499:0913/214405:ERROR:v8_value_converter_impl.cc(387)] Getter for property selectionDirection threw an exception.


Sep 13 21:44:05 computer-di-steve [0x0-0x13013].com.google.Chrome[241]: [416:138499:0913/214405:ERROR:v8_value_converter_impl.cc(387)] Getter for property selectionEnd threw an exception.


Sep 13 21:44:05 computer-di-steve [0x0-0x13013].com.google.Chrome[241]: [416:138499:0913/214405:ERROR:v8_value_converter_impl.cc(387)] Getter for property selectionStart threw an exception.


Sep 13 21:44:05 computer-di-steve [0x0-0x13013].com.google.Chrome[241]: [416:138499:0913/214405:ERROR:v8_value_converter_impl.cc(387)] Getter for property selectionDirection threw an exception.


Sep 13 21:44:05 computer-di-steve [0x0-0x13013].com.google.Chrome[241]: [416:138499:0913/214405:ERROR:v8_value_converter_impl.cc(387)] Getter for property selectionEnd threw an exception.


Sep 13 21:44:05 computer-di-steve [0x0-0x13013].com.google.Chrome[241]: [416:138499:0913/214405:ERROR:v8_value_converter_impl.cc(387)] Getter for property selectionStart threw an exception.


Sep 13 21:44:05 computer-di-steve [0x0-0x13013].com.google.Chrome[241]: [416:138499:0913/214405:ERROR:v8_value_converter_impl.cc(387)] Getter for property selectionDirection threw an exception.


Sep 13 21:44:05 computer-di-steve [0x0-0x13013].com.google.Chrome[241]: [416:138499:0913/214405:ERROR:v8_value_converter_impl.cc(387)] Getter for property selectionEnd threw an exception.


Sep 13 21:44:05 computer-di-steve [0x0-0x13013].com.google.Chrome[241]: [416:138499:0913/214405:ERROR:v8_value_converter_impl.cc(387)] Getter for property selectionStart threw an exception.


Sep 13 21:44:05 computer-di-steve [0x0-0x13013].com.google.Chrome[241]: [416:138499:0913/214405:ERROR:v8_value_converter_impl.cc(387)] Getter for property selectionDirection threw an exception.


Sep 13 21:44:05 computer-di-steve [0x0-0x13013].com.google.Chrome[241]: [416:138499:0913/214405:ERROR:v8_value_converter_impl.cc(387)] Getter for property selectionEnd threw an exception.


Sep 13 21:44:05 computer-di-steve [0x0-0x13013].com.google.Chrome[241]: [416:138499:0913/214405:ERROR:v8_value_converter_impl.cc(387)] Getter for property selectionStart threw an exception.


Sep 13 21:44:05 computer-di-steve [0x0-0x13013].com.google.Chrome[241]: [416:138499:0913/214405:ERROR:v8_value_converter_impl.cc(387)] Getter for property selectionDirection threw an exception.


Sep 13 21:44:05 computer-di-steve [0x0-0x13013].com.google.Chrome[241]: [416:138499:0913/214405:ERROR:v8_value_converter_impl.cc(387)] Getter for property selectionEnd threw an exception.


Sep 13 21:44:05 computer-di-steve [0x0-0x13013].com.google.Chrome[241]: [416:138499:0913/214405:ERROR:v8_value_converter_impl.cc(387)] Getter for property selectionStart threw an exception.


Sep 13 21:44:05 computer-di-steve [0x0-0x13013].com.google.Chrome[241]: [416:138499:0913/214405:ERROR:v8_value_converter_impl.cc(387)] Getter for property selectionDirection threw an exception.


Sep 13 21:44:05 computer-di-steve [0x0-0x13013].com.google.Chrome[241]: [416:138499:0913/214405:ERROR:v8_value_converter_impl.cc(387)] Getter for property selectionEnd threw an exception.


Sep 13 21:44:05 computer-di-steve [0x0-0x13013].com.google.Chrome[241]: [416:138499:0913/214405:ERROR:v8_value_converter_impl.cc(387)] Getter for property selectionStart threw an exception.


Sep 13 21:44:05 computer-di-steve [0x0-0x13013].com.google.Chrome[241]: [416:138499:0913/214405:ERROR:v8_value_converter_impl.cc(387)] Getter for property selectionDirection threw an exception.


Sep 13 21:44:05 computer-di-steve [0x0-0x13013].com.google.Chrome[241]: [416:138499:0913/214405:ERROR:v8_value_converter_impl.cc(387)] Getter for property selectionEnd threw an exception.


Sep 13 21:44:05 computer-di-steve [0x0-0x13013].com.google.Chrome[241]: [416:138499:0913/214405:ERROR:v8_value_converter_impl.cc(387)] Getter for property selectionStart threw an exception.


Sep 13 21:44:06 computer-di-steve [0x0-0x13013].com.google.Chrome[241]: [416:138499:0913/214406:ERROR:v8_value_converter_impl.cc(387)] Getter for property selectionDirection threw an exception.


Sep 13 21:44:06 computer-di-steve [0x0-0x13013].com.google.Chrome[241]: [416:138499:0913/214406:ERROR:v8_value_converter_impl.cc(387)] Getter for property selectionEnd threw an exception.


Sep 13 21:44:06 computer-di-steve [0x0-0x13013].com.google.Chrome[241]: [416:138499:0913/214406:ERROR:v8_value_converter_impl.cc(387)] Getter for property selectionStart threw an exception.


Sep 13 21:44:06 computer-di-steve [0x0-0x13013].com.google.Chrome[241]: [416:138499:0913/214406:ERROR:v8_value_converter_impl.cc(387)] Getter for property selectionDirection threw an exception.


Sep 13 21:44:06 computer-di-steve [0x0-0x13013].com.google.Chrome[241]: [416:138499:0913/214406:ERROR:v8_value_converter_impl.cc(387)] Getter for property selectionEnd threw an exception.


Sep 13 21:44:06 computer-di-steve [0x0-0x13013].com.google.Chrome[241]: [416:138499:0913/214406:ERROR:v8_value_converter_impl.cc(387)] Getter for property selectionStart threw an exception.


Sep 13 21:44:06 computer-di-steve [0x0-0x13013].com.google.Chrome[241]: [416:138499:0913/214406:ERROR:v8_value_converter_impl.cc(387)] Getter for property selectionDirection threw an exception.


Sep 13 21:44:06 computer-di-steve [0x0-0x13013].com.google.Chrome[241]: [416:138499:0913/214406:ERROR:v8_value_converter_impl.cc(387)] Getter for property selectionEnd threw an exception.


Sep 13 21:44:06 computer-di-steve [0x0-0x13013].com.google.Chrome[241]: [416:138499:0913/214406:ERROR:v8_value_converter_impl.cc(387)] Getter for property selectionStart threw an exception.


Sep 13 21:44:06 computer-di-steve [0x0-0x13013].com.google.Chrome[241]: [416:138499:0913/214406:ERROR:v8_value_converter_impl.cc(387)] Getter for property selectionDirection threw an exception.


Sep 13 21:44:06 computer-di-steve [0x0-0x13013].com.google.Chrome[241]: [416:138499:0913/214406:ERROR:v8_value_converter_impl.cc(387)] Getter for property selectionEnd threw an exception.


Sep 13 21:44:06 computer-di-steve [0x0-0x13013].com.google.Chrome[241]: [416:138499:0913/214406:ERROR:v8_value_converter_impl.cc(387)] Getter for property selectionStart threw an exception.


Sep 13 21:44:06 computer-di-steve [0x0-0x13013].com.google.Chrome[241]: [416:138499:0913/214406:ERROR:v8_value_converter_impl.cc(387)] Getter for property selectionDirection threw an exception.


Sep 13 21:44:06 computer-di-steve [0x0-0x13013].com.google.Chrome[241]: [416:138499:0913/214406:ERROR:v8_value_converter_impl.cc(387)] Getter for property selectionEnd threw an exception.


Sep 13 21:44:06 computer-di-steve [0x0-0x13013].com.google.Chrome[241]: [416:138499:0913/214406:ERROR:v8_value_converter_impl.cc(387)] Getter for property selectionStart threw an exception.


Sep 13 21:44:06 computer-di-steve [0x0-0x13013].com.google.Chrome[241]: [416:138499:0913/214406:ERROR:v8_value_converter_impl.cc(387)] Getter for property selectionDirection threw an exception.


Sep 13 21:44:06 computer-di-steve [0x0-0x13013].com.google.Chrome[241]: [416:138499:0913/214406:ERROR:v8_value_converter_impl.cc(387)] Getter for property selectionEnd threw an exception.


Sep 13 21:44:06 computer-di-steve [0x0-0x13013].com.google.Chrome[241]: [416:138499:0913/214406:ERROR:v8_value_converter_impl.cc(387)] Getter for property selectionStart threw an exception.


Sep 13 21:44:06 computer-di-steve [0x0-0x13013].com.google.Chrome[241]: [416:138499:0913/214406:ERROR:v8_value_converter_impl.cc(387)] Getter for property selectionDirection threw an exception.


Sep 13 21:44:06 computer-di-steve [0x0-0x13013].com.google.Chrome[241]: [416:138499:0913/214406:ERROR:v8_value_converter_impl.cc(387)] Getter for property selectionEnd threw an exception.


Sep 13 21:44:06 computer-di-steve [0x0-0x13013].com.google.Chrome[241]: [416:138499:0913/214406:ERROR:v8_value_converter_impl.cc(387)] Getter for property selectionStart threw an exception.


Sep 13 21:44:06 computer-di-steve [0x0-0x13013].com.google.Chrome[241]: [416:138499:0913/214406:ERROR:v8_value_converter_impl.cc(387)] Getter for property selectionDirection threw an exception.


Sep 13 21:44:06 computer-di-steve [0x0-0x13013].com.google.Chrome[241]: [416:138499:0913/214406:ERROR:v8_value_converter_impl.cc(387)] Getter for property selectionEnd threw an exception.


Sep 13 21:44:06 computer-di-steve [0x0-0x13013].com.google.Chrome[241]: [416:138499:0913/214406:ERROR:v8_value_converter_impl.cc(387)] Getter for property selectionStart threw an exception.


Sep 13 21:44:06 computer-di-steve [0x0-0x13013].com.google.Chrome[241]: [416:138499:0913/214406:ERROR:v8_value_converter_impl.cc(387)] Getter for property selectionDirection threw an exception.


Sep 13 21:44:06 computer-di-steve [0x0-0x13013].com.google.Chrome[241]: [416:138499:0913/214406:ERROR:v8_value_converter_impl.cc(387)] Getter for property selectionEnd threw an exception.


Sep 13 21:44:06 computer-di-steve [0x0-0x13013].com.google.Chrome[241]: [416:138499:0913/214406:ERROR:v8_value_converter_impl.cc(387)] Getter for property selectionStart threw an exception.


Sep 13 21:44:06 computer-di-steve [0x0-0x13013].com.google.Chrome[241]: [416:138499:0913/214406:ERROR:v8_value_converter_impl.cc(387)] Getter for property selectionDirection threw an exception.


Sep 13 21:44:06 computer-di-steve [0x0-0x13013].com.google.Chrome[241]: [416:138499:0913/214406:ERROR:v8_value_converter_impl.cc(387)] Getter for property selectionEnd threw an exception.


Sep 13 21:44:06 computer-di-steve [0x0-0x13013].com.google.Chrome[241]: [416:138499:0913/214406:ERROR:v8_value_converter_impl.cc(387)] Getter for property selectionStart threw an exception.


Sep 13 21:44:06 computer-di-steve [0x0-0x13013].com.google.Chrome[241]: [416:138499:0913/214406:ERROR:v8_value_converter_impl.cc(387)] Getter for property selectionDirection threw an exception.


Sep 13 21:44:06 computer-di-steve [0x0-0x13013].com.google.Chrome[241]: [416:138499:0913/214406:ERROR:v8_value_converter_impl.cc(387)] Getter for property selectionEnd threw an exception.


Sep 13 21:44:06 computer-di-steve [0x0-0x13013].com.google.Chrome[241]: [416:138499:0913/214406:ERROR:v8_value_converter_impl.cc(387)] Getter for property selectionStart threw an exception.


Sep 13 21:44:06 computer-di-steve [0x0-0x13013].com.google.Chrome[241]: [416:138499:0913/214406:ERROR:v8_value_converter_impl.cc(387)] Getter for property selectionDirection threw an exception.


Sep 13 21:44:06 computer-di-steve [0x0-0x13013].com.google.Chrome[241]: [416:138499:0913/214406:ERROR:v8_value_converter_impl.cc(387)] Getter for property selectionEnd threw an exception.


Sep 13 21:44:06 computer-di-steve [0x0-0x13013].com.google.Chrome[241]: [416:138499:0913/214406:ERROR:v8_value_converter_impl.cc(387)] Getter for property selectionStart threw an exception.


Sep 13 21:44:06 computer-di-steve [0x0-0x13013].com.google.Chrome[241]: [416:138499:0913/214406:ERROR:v8_value_converter_impl.cc(387)] Getter for property selectionDirection threw an exception.


Sep 13 21:44:06 computer-di-steve [0x0-0x13013].com.google.Chrome[241]: [416:138499:0913/214406:ERROR:v8_value_converter_impl.cc(387)] Getter for property selectionEnd threw an exception.


Sep 13 21:44:06 computer-di-steve [0x0-0x13013].com.google.Chrome[241]: [416:138499:0913/214406:ERROR:v8_value_converter_impl.cc(387)] Getter for property selectionStart threw an exception.


Sep 13 21:44:06 computer-di-steve [0x0-0x13013].com.google.Chrome[241]: [416:138499:0913/214406:ERROR:v8_value_converter_impl.cc(387)] Getter for property selectionDirection threw an exception.


Sep 13 21:44:06 computer-di-steve [0x0-0x13013].com.google.Chrome[241]: [416:138499:0913/214406:ERROR:v8_value_converter_impl.cc(387)] Getter for property selectionEnd threw an exception.


Sep 13 21:44:06 computer-di-steve [0x0-0x13013].com.google.Chrome[241]: [416:138499:0913/214406:ERROR:v8_value_converter_impl.cc(387)] Getter for property selectionStart threw an exception.


Sep 13 21:44:06 computer-di-steve [0x0-0x13013].com.google.Chrome[241]: [416:138499:0913/214406:ERROR:v8_value_converter_impl.cc(387)] Getter for property selectionDirection threw an exception.


Sep 13 21:44:06 computer-di-steve [0x0-0x13013].com.google.Chrome[241]: [416:138499:0913/214406:ERROR:v8_value_converter_impl.cc(387)] Getter for property selectionEnd threw an exception.


Sep 13 21:44:06 computer-di-steve [0x0-0x13013].com.google.Chrome[241]: [416:138499:0913/214406:ERROR:v8_value_converter_impl.cc(387)] Getter for property selectionStart threw an exception.


Sep 13 21:44:06 computer-di-steve [0x0-0x13013].com.google.Chrome[241]: [416:138499:0913/214406:ERROR:v8_value_converter_impl.cc(387)] Getter for property selectionDirection threw an exception.


Sep 13 21:44:06 computer-di-steve [0x0-0x13013].com.google.Chrome[241]: [416:138499:0913/214406:ERROR:v8_value_converter_impl.cc(387)] Getter for property selectionEnd threw an exception.


Sep 13 21:44:06 computer-di-steve [0x0-0x13013].com.google.Chrome[241]: [416:138499:0913/214406:ERROR:v8_value_converter_impl.cc(387)] Getter for property selectionStart threw an exception.


Sep 13 21:44:06 computer-di-steve [0x0-0x13013].com.google.Chrome[241]: [416:138499:0913/214406:ERROR:v8_value_converter_impl.cc(387)] Getter for property selectionDirection threw an exception.


Sep 13 21:44:06 computer-di-steve [0x0-0x13013].com.google.Chrome[241]: [416:138499:0913/214406:ERROR:v8_value_converter_impl.cc(387)] Getter for property selectionEnd threw an exception.


Sep 13 21:44:06 computer-di-steve [0x0-0x13013].com.google.Chrome[241]: [416:138499:0913/214406:ERROR:v8_value_converter_impl.cc(387)] Getter for property selectionStart threw an exception.


Sep 13 21:44:07 computer-di-steve [0x0-0x13013].com.google.Chrome[241]: [416:138499:0913/214407:ERROR:v8_value_converter_impl.cc(387)] Getter for property selectionDirection threw an exception.


Sep 13 21:44:07 computer-di-steve [0x0-0x13013].com.google.Chrome[241]: [416:138499:0913/214407:ERROR:v8_value_converter_impl.cc(387)] Getter for property selectionEnd threw an exception.


Sep 13 21:44:07 computer-di-steve [0x0-0x13013].com.google.Chrome[241]: [416:138499:0913/214407:ERROR:v8_value_converter_impl.cc(387)] Getter for property selectionStart threw an exception.


Sep 13 21:44:07 computer-di-steve [0x0-0x13013].com.google.Chrome[241]: [416:138499:0913/214407:ERROR:v8_value_converter_impl.cc(387)] Getter for property selectionDirection threw an exception.


Sep 13 21:44:07 computer-di-steve [0x0-0x13013].com.google.Chrome[241]: [416:138499:0913/214407:ERROR:v8_value_converter_impl.cc(387)] Getter for property selectionEnd threw an exception.


Sep 13 21:44:07 computer-di-steve [0x0-0x13013].com.google.Chrome[241]: [416:138499:0913/214407:ERROR:v8_value_converter_impl.cc(387)] Getter for property selectionStart threw an exception.


Sep 13 21:44:07 computer-di-steve [0x0-0x13013].com.google.Chrome[241]: [416:138499:0913/214407:ERROR:v8_value_converter_impl.cc(387)] Getter for property selectionDirection threw an exception.


Sep 13 21:44:07 computer-di-steve [0x0-0x13013].com.google.Chrome[241]: [416:138499:0913/214407:ERROR:v8_value_converter_impl.cc(387)] Getter for property selectionEnd threw an exception.


Sep 13 21:44:07 computer-di-steve [0x0-0x13013].com.google.Chrome[241]: [416:138499:0913/214407:ERROR:v8_value_converter_impl.cc(387)] Getter for property selectionStart threw an exception.


Sep 13 21:44:07 computer-di-steve [0x0-0x13013].com.google.Chrome[241]: [416:138499:0913/214407:ERROR:v8_value_converter_impl.cc(387)] Getter for property selectionDirection threw an exception.


Sep 13 21:44:07 computer-di-steve [0x0-0x13013].com.google.Chrome[241]: [416:138499:0913/214407:ERROR:v8_value_converter_impl.cc(387)] Getter for property selectionEnd threw an exception.


Sep 13 21:44:07 computer-di-steve [0x0-0x13013].com.google.Chrome[241]: [416:138499:0913/214407:ERROR:v8_value_converter_impl.cc(387)] Getter for property selectionStart threw an exception.


Sep 13 21:44:07 computer-di-steve [0x0-0x13013].com.google.Chrome[241]: [416:138499:0913/214407:ERROR:v8_value_converter_impl.cc(387)] Getter for property selectionDirection threw an exception.


Sep 13 21:44:07 computer-di-steve [0x0-0x13013].com.google.Chrome[241]: [416:138499:0913/214407:ERROR:v8_value_converter_impl.cc(387)] Getter for property selectionEnd threw an exception.


Sep 13 21:44:07 computer-di-steve [0x0-0x13013].com.google.Chrome[241]: [416:138499:0913/214407:ERROR:v8_value_converter_impl.cc(387)] Getter for property selectionStart threw an exception.


Sep 13 21:44:07 computer-di-steve [0x0-0x13013].com.google.Chrome[241]: [416:138499:0913/214407:ERROR:v8_value_converter_impl.cc(387)] Getter for property selectionDirection threw an exception.


Sep 13 21:44:07 computer-di-steve [0x0-0x13013].com.google.Chrome[241]: [416:138499:0913/214407:ERROR:v8_value_converter_impl.cc(387)] Getter for property selectionEnd threw an exception.


Sep 13 21:44:07 computer-di-steve [0x0-0x13013].com.google.Chrome[241]: [416:138499:0913/214407:ERROR:v8_value_converter_impl.cc(387)] Getter for property selectionStart threw an exception.


Sep 13 21:44:07 computer-di-steve [0x0-0x13013].com.google.Chrome[241]: [416:138499:0913/214407:ERROR:v8_value_converter_impl.cc(387)] Getter for property selectionDirection threw an exception.


Sep 13 21:44:07 computer-di-steve [0x0-0x13013].com.google.Chrome[241]: [416:138499:0913/214407:ERROR:v8_value_converter_impl.cc(387)] Getter for property selectionEnd threw an exception.


Sep 13 21:44:07 computer-di-steve [0x0-0x13013].com.google.Chrome[241]: [416:138499:0913/214407:ERROR:v8_value_converter_impl.cc(387)] Getter for property selectionStart threw an exception.


Sep 13 21:44:07 computer-di-steve [0x0-0x13013].com.google.Chrome[241]: [416:138499:0913/214407:ERROR:v8_value_converter_impl.cc(387)] Getter for property selectionDirection threw an exception.


Sep 13 21:44:07 computer-di-steve [0x0-0x13013].com.google.Chrome[241]: [416:138499:0913/214407:ERROR:v8_value_converter_impl.cc(387)] Getter for property selectionEnd threw an exception.


Sep 13 21:44:07 computer-di-steve [0x0-0x13013].com.google.Chrome[241]: [416:138499:0913/214407:ERROR:v8_value_converter_impl.cc(387)] Getter for property selectionStart threw an exception.


Sep 13 21:44:07 computer-di-steve [0x0-0x13013].com.google.Chrome[241]: [416:138499:0913/214407:ERROR:v8_value_converter_impl.cc(387)] Getter for property selectionDirection threw an exception.


Sep 13 21:44:07 computer-di-steve [0x0-0x13013].com.google.Chrome[241]: [416:138499:0913/214407:ERROR:v8_value_converter_impl.cc(387)] Getter for property selectionEnd threw an exception.


Sep 13 21:44:07 computer-di-steve [0x0-0x13013].com.google.Chrome[241]: [416:138499:0913/214407:ERROR:v8_value_converter_impl.cc(387)] Getter for property selectionStart threw an exception.


Sep 13 21:44:07 computer-di-steve [0x0-0x13013].com.google.Chrome[241]: [416:138499:0913/214407:ERROR:v8_value_converter_impl.cc(387)] Getter for property selectionDirection threw an exception.


Sep 13 21:44:07 computer-di-steve [0x0-0x13013].com.google.Chrome[241]: [416:138499:0913/214407:ERROR:v8_value_converter_impl.cc(387)] Getter for property selectionEnd threw an exception.


Sep 13 21:44:07 computer-di-steve [0x0-0x13013].com.google.Chrome[241]: [416:138499:0913/214407:ERROR:v8_value_converter_impl.cc(387)] Getter for property selectionStart threw an exception.


Sep 13 21:44:07 computer-di-steve [0x0-0x13013].com.google.Chrome[241]: [416:138499:0913/214407:ERROR:v8_value_converter_impl.cc(387)] Getter for property selectionDirection threw an exception.


Sep 13 21:44:07 computer-di-steve [0x0-0x13013].com.google.Chrome[241]: [416:138499:0913/214407:ERROR:v8_value_converter_impl.cc(387)] Getter for property selectionEnd threw an exception.


Sep 13 21:44:07 computer-di-steve [0x0-0x13013].com.google.Chrome[241]: [416:138499:0913/214407:ERROR:v8_value_converter_impl.cc(387)] Getter for property selectionStart threw an exception.


Sep 13 21:44:07 computer-di-steve [0x0-0x13013].com.google.Chrome[241]: [416:138499:0913/214407:ERROR:v8_value_converter_impl.cc(387)] Getter for property selectionDirection threw an exception.


Sep 13 21:44:07 computer-di-steve [0x0-0x13013].com.google.Chrome[241]: [416:138499:0913/214407:ERROR:v8_value_converter_impl.cc(387)] Getter for property selectionEnd threw an exception.


Sep 13 21:44:07 computer-di-steve [0x0-0x13013].com.google.Chrome[241]: [416:138499:0913/214407:ERROR:v8_value_converter_impl.cc(387)] Getter for property selectionStart threw an exception.


Sep 13 21:44:07 computer-di-steve [0x0-0x13013].com.google.Chrome[241]: [416:138499:0913/214407:ERROR:v8_value_converter_impl.cc(387)] Getter for property selectionDirection threw an exception.


Sep 13 21:44:07 computer-di-steve [0x0-0x13013].com.google.Chrome[241]: [416:138499:0913/214407:ERROR:v8_value_converter_impl.cc(387)] Getter for property selectionEnd threw an exception.


Sep 13 21:44:07 computer-di-steve [0x0-0x13013].com.google.Chrome[241]: [416:138499:0913/214407:ERROR:v8_value_converter_impl.cc(387)] Getter for property selectionStart threw an exception.


Sep 13 21:44:34 computer-di-steve [0x0-0x13013].com.google.Chrome[241]: [241:138499:0913/214434:ERROR:audio_manager_base.cc(244)] Invalid audio output parameters received; using fake audio path. Channels: 2, Sample Rate: 0, Bits Per Sample: 16, Frames Per Buffer: 128


Share this post


Link to post
Share on other sites

Create an account or sign in to comment

You need to be a member in order to leave a comment

Create an account

Sign up for a new account in our community. It's easy!

Register a new account

Sign in

Already have an account? Sign in here.

Sign In Now