nicklaus

Blocco totale del sistema operativo OS X v. 10.7.5 (Freeze)

Recommended Posts

Sep 13 21:44:58 computer-di-steve [0x0-0x13013].com.google.Chrome[241]: [416:138499:0913/214458:ERROR:v8_value_converter_impl.cc(387)] Getter for property selectionDirection threw an exception.


Sep 13 21:44:58 computer-di-steve [0x0-0x13013].com.google.Chrome[241]: [416:138499:0913/214458:ERROR:v8_value_converter_impl.cc(387)] Getter for property selectionEnd threw an exception.


Sep 13 21:44:58 computer-di-steve [0x0-0x13013].com.google.Chrome[241]: [416:138499:0913/214458:ERROR:v8_value_converter_impl.cc(387)] Getter for property selectionStart threw an exception.


Sep 13 21:44:58 computer-di-steve [0x0-0x13013].com.google.Chrome[241]: [416:138499:0913/214458:ERROR:v8_value_converter_impl.cc(387)] Getter for property selectionDirection threw an exception.


Sep 13 21:44:58 computer-di-steve [0x0-0x13013].com.google.Chrome[241]: [416:138499:0913/214458:ERROR:v8_value_converter_impl.cc(387)] Getter for property selectionEnd threw an exception.


Sep 13 21:44:58 computer-di-steve [0x0-0x13013].com.google.Chrome[241]: [416:138499:0913/214458:ERROR:v8_value_converter_impl.cc(387)] Getter for property selectionStart threw an exception.


Sep 13 21:44:58 computer-di-steve [0x0-0x13013].com.google.Chrome[241]: [416:138499:0913/214458:ERROR:v8_value_converter_impl.cc(387)] Getter for property selectionDirection threw an exception.


Sep 13 21:44:58 computer-di-steve [0x0-0x13013].com.google.Chrome[241]: [416:138499:0913/214458:ERROR:v8_value_converter_impl.cc(387)] Getter for property selectionEnd threw an exception.


Sep 13 21:44:58 computer-di-steve [0x0-0x13013].com.google.Chrome[241]: [416:138499:0913/214458:ERROR:v8_value_converter_impl.cc(387)] Getter for property selectionStart threw an exception.


Sep 13 21:44:58 computer-di-steve [0x0-0x13013].com.google.Chrome[241]: [416:138499:0913/214458:ERROR:v8_value_converter_impl.cc(387)] Getter for property selectionDirection threw an exception.


Sep 13 21:44:58 computer-di-steve [0x0-0x13013].com.google.Chrome[241]: [416:138499:0913/214458:ERROR:v8_value_converter_impl.cc(387)] Getter for property selectionEnd threw an exception.


Sep 13 21:44:58 computer-di-steve [0x0-0x13013].com.google.Chrome[241]: [416:138499:0913/214458:ERROR:v8_value_converter_impl.cc(387)] Getter for property selectionStart threw an exception.


Sep 13 21:44:58 computer-di-steve [0x0-0x13013].com.google.Chrome[241]: [416:138499:0913/214458:ERROR:v8_value_converter_impl.cc(387)] Getter for property selectionDirection threw an exception.


Sep 13 21:44:58 computer-di-steve [0x0-0x13013].com.google.Chrome[241]: [416:138499:0913/214458:ERROR:v8_value_converter_impl.cc(387)] Getter for property selectionEnd threw an exception.


Sep 13 21:44:58 computer-di-steve [0x0-0x13013].com.google.Chrome[241]: [416:138499:0913/214458:ERROR:v8_value_converter_impl.cc(387)] Getter for property selectionStart threw an exception.


Sep 13 21:44:58 computer-di-steve [0x0-0x13013].com.google.Chrome[241]: [416:138499:0913/214458:ERROR:v8_value_converter_impl.cc(387)] Getter for property selectionDirection threw an exception.


Sep 13 21:44:58 computer-di-steve [0x0-0x13013].com.google.Chrome[241]: [416:138499:0913/214458:ERROR:v8_value_converter_impl.cc(387)] Getter for property selectionEnd threw an exception.


Sep 13 21:44:58 computer-di-steve [0x0-0x13013].com.google.Chrome[241]: [416:138499:0913/214458:ERROR:v8_value_converter_impl.cc(387)] Getter for property selectionStart threw an exception.


Sep 13 21:44:58 computer-di-steve [0x0-0x13013].com.google.Chrome[241]: [416:138499:0913/214458:ERROR:v8_value_converter_impl.cc(387)] Getter for property selectionDirection threw an exception.


Sep 13 21:44:58 computer-di-steve [0x0-0x13013].com.google.Chrome[241]: [416:138499:0913/214458:ERROR:v8_value_converter_impl.cc(387)] Getter for property selectionEnd threw an exception.


Sep 13 21:44:58 computer-di-steve [0x0-0x13013].com.google.Chrome[241]: [416:138499:0913/214458:ERROR:v8_value_converter_impl.cc(387)] Getter for property selectionStart threw an exception.


Sep 13 21:44:58 computer-di-steve [0x0-0x13013].com.google.Chrome[241]: [416:138499:0913/214458:ERROR:v8_value_converter_impl.cc(387)] Getter for property selectionDirection threw an exception.


Sep 13 21:44:58 computer-di-steve [0x0-0x13013].com.google.Chrome[241]: [416:138499:0913/214458:ERROR:v8_value_converter_impl.cc(387)] Getter for property selectionEnd threw an exception.


Sep 13 21:44:58 computer-di-steve [0x0-0x13013].com.google.Chrome[241]: [416:138499:0913/214458:ERROR:v8_value_converter_impl.cc(387)] Getter for property selectionStart threw an exception.


Sep 13 21:44:59 computer-di-steve [0x0-0x13013].com.google.Chrome[241]: [416:138499:0913/214459:ERROR:v8_value_converter_impl.cc(387)] Getter for property selectionDirection threw an exception.


Sep 13 21:44:59 computer-di-steve [0x0-0x13013].com.google.Chrome[241]: [416:138499:0913/214459:ERROR:v8_value_converter_impl.cc(387)] Getter for property selectionEnd threw an exception.


Sep 13 21:44:59 computer-di-steve [0x0-0x13013].com.google.Chrome[241]: [416:138499:0913/214459:ERROR:v8_value_converter_impl.cc(387)] Getter for property selectionStart threw an exception.


Sep 13 21:44:59 computer-di-steve [0x0-0x13013].com.google.Chrome[241]: [416:138499:0913/214459:ERROR:v8_value_converter_impl.cc(387)] Getter for property selectionDirection threw an exception.


Sep 13 21:44:59 computer-di-steve [0x0-0x13013].com.google.Chrome[241]: [416:138499:0913/214459:ERROR:v8_value_converter_impl.cc(387)] Getter for property selectionEnd threw an exception.


Sep 13 21:44:59 computer-di-steve [0x0-0x13013].com.google.Chrome[241]: [416:138499:0913/214459:ERROR:v8_value_converter_impl.cc(387)] Getter for property selectionStart threw an exception.


Sep 13 21:44:59 computer-di-steve [0x0-0x13013].com.google.Chrome[241]: [416:138499:0913/214459:ERROR:v8_value_converter_impl.cc(387)] Getter for property selectionDirection threw an exception.


Sep 13 21:44:59 computer-di-steve [0x0-0x13013].com.google.Chrome[241]: [416:138499:0913/214459:ERROR:v8_value_converter_impl.cc(387)] Getter for property selectionEnd threw an exception.


Sep 13 21:44:59 computer-di-steve [0x0-0x13013].com.google.Chrome[241]: [416:138499:0913/214459:ERROR:v8_value_converter_impl.cc(387)] Getter for property selectionStart threw an exception.


Sep 13 21:44:59 computer-di-steve [0x0-0x13013].com.google.Chrome[241]: [416:138499:0913/214459:ERROR:v8_value_converter_impl.cc(387)] Getter for property selectionDirection threw an exception.


Sep 13 21:44:59 computer-di-steve [0x0-0x13013].com.google.Chrome[241]: [416:138499:0913/214459:ERROR:v8_value_converter_impl.cc(387)] Getter for property selectionEnd threw an exception.


Sep 13 21:44:59 computer-di-steve [0x0-0x13013].com.google.Chrome[241]: [416:138499:0913/214459:ERROR:v8_value_converter_impl.cc(387)] Getter for property selectionStart threw an exception.


Sep 13 21:44:59 computer-di-steve [0x0-0x13013].com.google.Chrome[241]: [416:138499:0913/214459:ERROR:v8_value_converter_impl.cc(387)] Getter for property selectionDirection threw an exception.


Sep 13 21:44:59 computer-di-steve [0x0-0x13013].com.google.Chrome[241]: [416:138499:0913/214459:ERROR:v8_value_converter_impl.cc(387)] Getter for property selectionEnd threw an exception.


Sep 13 21:44:59 computer-di-steve [0x0-0x13013].com.google.Chrome[241]: [416:138499:0913/214459:ERROR:v8_value_converter_impl.cc(387)] Getter for property selectionStart threw an exception.


Sep 13 21:44:59 computer-di-steve [0x0-0x13013].com.google.Chrome[241]: [416:138499:0913/214459:ERROR:v8_value_converter_impl.cc(387)] Getter for property selectionDirection threw an exception.


Sep 13 21:44:59 computer-di-steve [0x0-0x13013].com.google.Chrome[241]: [416:138499:0913/214459:ERROR:v8_value_converter_impl.cc(387)] Getter for property selectionEnd threw an exception.


Sep 13 21:44:59 computer-di-steve [0x0-0x13013].com.google.Chrome[241]: [416:138499:0913/214459:ERROR:v8_value_converter_impl.cc(387)] Getter for property selectionStart threw an exception.


Sep 13 21:44:59 computer-di-steve [0x0-0x13013].com.google.Chrome[241]: [416:138499:0913/214459:ERROR:v8_value_converter_impl.cc(387)] Getter for property selectionDirection threw an exception.


Sep 13 21:44:59 computer-di-steve [0x0-0x13013].com.google.Chrome[241]: [416:138499:0913/214459:ERROR:v8_value_converter_impl.cc(387)] Getter for property selectionEnd threw an exception.


Sep 13 21:44:59 computer-di-steve [0x0-0x13013].com.google.Chrome[241]: [416:138499:0913/214459:ERROR:v8_value_converter_impl.cc(387)] Getter for property selectionStart threw an exception.


Sep 13 21:44:59 computer-di-steve [0x0-0x13013].com.google.Chrome[241]: [416:138499:0913/214459:ERROR:v8_value_converter_impl.cc(387)] Getter for property selectionDirection threw an exception.


Sep 13 21:44:59 computer-di-steve [0x0-0x13013].com.google.Chrome[241]: [416:138499:0913/214459:ERROR:v8_value_converter_impl.cc(387)] Getter for property selectionEnd threw an exception.


Sep 13 21:44:59 computer-di-steve [0x0-0x13013].com.google.Chrome[241]: [416:138499:0913/214459:ERROR:v8_value_converter_impl.cc(387)] Getter for property selectionStart threw an exception.


Sep 13 21:44:59 computer-di-steve [0x0-0x13013].com.google.Chrome[241]: [416:138499:0913/214459:ERROR:v8_value_converter_impl.cc(387)] Getter for property selectionDirection threw an exception.


Sep 13 21:44:59 computer-di-steve [0x0-0x13013].com.google.Chrome[241]: [416:138499:0913/214459:ERROR:v8_value_converter_impl.cc(387)] Getter for property selectionEnd threw an exception.


Sep 13 21:44:59 computer-di-steve [0x0-0x13013].com.google.Chrome[241]: [416:138499:0913/214459:ERROR:v8_value_converter_impl.cc(387)] Getter for property selectionStart threw an exception.


Sep 13 21:44:59 computer-di-steve [0x0-0x13013].com.google.Chrome[241]: [416:138499:0913/214459:ERROR:v8_value_converter_impl.cc(387)] Getter for property selectionDirection threw an exception.


Sep 13 21:44:59 computer-di-steve [0x0-0x13013].com.google.Chrome[241]: [416:138499:0913/214459:ERROR:v8_value_converter_impl.cc(387)] Getter for property selectionEnd threw an exception.


Sep 13 21:44:59 computer-di-steve [0x0-0x13013].com.google.Chrome[241]: [416:138499:0913/214459:ERROR:v8_value_converter_impl.cc(387)] Getter for property selectionStart threw an exception.


Sep 13 21:44:59 computer-di-steve [0x0-0x13013].com.google.Chrome[241]: [416:138499:0913/214459:ERROR:v8_value_converter_impl.cc(387)] Getter for property selectionDirection threw an exception.


Sep 13 21:44:59 computer-di-steve [0x0-0x13013].com.google.Chrome[241]: [416:138499:0913/214459:ERROR:v8_value_converter_impl.cc(387)] Getter for property selectionEnd threw an exception.


Sep 13 21:44:59 computer-di-steve [0x0-0x13013].com.google.Chrome[241]: [416:138499:0913/214459:ERROR:v8_value_converter_impl.cc(387)] Getter for property selectionStart threw an exception.


Sep 13 21:44:59 computer-di-steve [0x0-0x13013].com.google.Chrome[241]: [416:138499:0913/214459:ERROR:v8_value_converter_impl.cc(387)] Getter for property selectionDirection threw an exception.


Sep 13 21:44:59 computer-di-steve [0x0-0x13013].com.google.Chrome[241]: [416:138499:0913/214459:ERROR:v8_value_converter_impl.cc(387)] Getter for property selectionEnd threw an exception.


Sep 13 21:44:59 computer-di-steve [0x0-0x13013].com.google.Chrome[241]: [416:138499:0913/214459:ERROR:v8_value_converter_impl.cc(387)] Getter for property selectionStart threw an exception.


Sep 13 21:44:59 computer-di-steve [0x0-0x13013].com.google.Chrome[241]: [416:138499:0913/214459:ERROR:v8_value_converter_impl.cc(387)] Getter for property selectionDirection threw an exception.


Sep 13 21:44:59 computer-di-steve [0x0-0x13013].com.google.Chrome[241]: [416:138499:0913/214459:ERROR:v8_value_converter_impl.cc(387)] Getter for property selectionEnd threw an exception.


Sep 13 21:44:59 computer-di-steve [0x0-0x13013].com.google.Chrome[241]: [416:138499:0913/214459:ERROR:v8_value_converter_impl.cc(387)] Getter for property selectionStart threw an exception.


Sep 13 21:44:59 computer-di-steve [0x0-0x13013].com.google.Chrome[241]: [416:138499:0913/214459:ERROR:v8_value_converter_impl.cc(387)] Getter for property selectionDirection threw an exception.


Sep 13 21:44:59 computer-di-steve [0x0-0x13013].com.google.Chrome[241]: [416:138499:0913/214459:ERROR:v8_value_converter_impl.cc(387)] Getter for property selectionEnd threw an exception.


Sep 13 21:44:59 computer-di-steve [0x0-0x13013].com.google.Chrome[241]: [416:138499:0913/214459:ERROR:v8_value_converter_impl.cc(387)] Getter for property selectionStart threw an exception.


Sep 13 21:44:59 computer-di-steve [0x0-0x13013].com.google.Chrome[241]: [416:138499:0913/214459:ERROR:v8_value_converter_impl.cc(387)] Getter for property selectionDirection threw an exception.


Sep 13 21:44:59 computer-di-steve [0x0-0x13013].com.google.Chrome[241]: [416:138499:0913/214459:ERROR:v8_value_converter_impl.cc(387)] Getter for property selectionEnd threw an exception.


Sep 13 21:44:59 computer-di-steve [0x0-0x13013].com.google.Chrome[241]: [416:138499:0913/214459:ERROR:v8_value_converter_impl.cc(387)] Getter for property selectionStart threw an exception.


Sep 13 21:44:59 computer-di-steve [0x0-0x13013].com.google.Chrome[241]: [416:138499:0913/214459:ERROR:v8_value_converter_impl.cc(387)] Getter for property selectionDirection threw an exception.


Sep 13 21:44:59 computer-di-steve [0x0-0x13013].com.google.Chrome[241]: [416:138499:0913/214459:ERROR:v8_value_converter_impl.cc(387)] Getter for property selectionEnd threw an exception.


Sep 13 21:44:59 computer-di-steve [0x0-0x13013].com.google.Chrome[241]: [416:138499:0913/214459:ERROR:v8_value_converter_impl.cc(387)] Getter for property selectionStart threw an exception.


Sep 13 21:44:59 computer-di-steve [0x0-0x13013].com.google.Chrome[241]: [416:138499:0913/214459:ERROR:v8_value_converter_impl.cc(387)] Getter for property selectionDirection threw an exception.


Sep 13 21:44:59 computer-di-steve [0x0-0x13013].com.google.Chrome[241]: [416:138499:0913/214459:ERROR:v8_value_converter_impl.cc(387)] Getter for property selectionEnd threw an exception.


Sep 13 21:44:59 computer-di-steve [0x0-0x13013].com.google.Chrome[241]: [416:138499:0913/214459:ERROR:v8_value_converter_impl.cc(387)] Getter for property selectionStart threw an exception.


Sep 13 21:45:00 computer-di-steve [0x0-0x13013].com.google.Chrome[241]: [416:138499:0913/214500:ERROR:v8_value_converter_impl.cc(387)] Getter for property selectionDirection threw an exception.


Sep 13 21:45:00 computer-di-steve [0x0-0x13013].com.google.Chrome[241]: [416:138499:0913/214500:ERROR:v8_value_converter_impl.cc(387)] Getter for property selectionEnd threw an exception.


Sep 13 21:45:00 computer-di-steve [0x0-0x13013].com.google.Chrome[241]: [416:138499:0913/214500:ERROR:v8_value_converter_impl.cc(387)] Getter for property selectionStart threw an exception.


Sep 13 21:45:00 computer-di-steve [0x0-0x13013].com.google.Chrome[241]: [416:138499:0913/214500:ERROR:v8_value_converter_impl.cc(387)] Getter for property selectionDirection threw an exception.


Sep 13 21:45:00 computer-di-steve [0x0-0x13013].com.google.Chrome[241]: [416:138499:0913/214500:ERROR:v8_value_converter_impl.cc(387)] Getter for property selectionEnd threw an exception.


Sep 13 21:45:00 computer-di-steve [0x0-0x13013].com.google.Chrome[241]: [416:138499:0913/214500:ERROR:v8_value_converter_impl.cc(387)] Getter for property selectionStart threw an exception.


Sep 13 21:45:00 computer-di-steve [0x0-0x13013].com.google.Chrome[241]: [416:138499:0913/214500:ERROR:v8_value_converter_impl.cc(387)] Getter for property selectionDirection threw an exception.


Sep 13 21:45:00 computer-di-steve [0x0-0x13013].com.google.Chrome[241]: [416:138499:0913/214500:ERROR:v8_value_converter_impl.cc(387)] Getter for property selectionEnd threw an exception.


Sep 13 21:45:00 computer-di-steve [0x0-0x13013].com.google.Chrome[241]: [416:138499:0913/214500:ERROR:v8_value_converter_impl.cc(387)] Getter for property selectionStart threw an exception.


Sep 13 21:45:00 computer-di-steve [0x0-0x13013].com.google.Chrome[241]: [416:138499:0913/214500:ERROR:v8_value_converter_impl.cc(387)] Getter for property selectionDirection threw an exception.


Sep 13 21:45:00 computer-di-steve [0x0-0x13013].com.google.Chrome[241]: [416:138499:0913/214500:ERROR:v8_value_converter_impl.cc(387)] Getter for property selectionEnd threw an exception.


Sep 13 21:45:00 computer-di-steve [0x0-0x13013].com.google.Chrome[241]: [416:138499:0913/214500:ERROR:v8_value_converter_impl.cc(387)] Getter for property selectionStart threw an exception.


Sep 13 21:45:00 computer-di-steve [0x0-0x13013].com.google.Chrome[241]: [416:138499:0913/214500:ERROR:v8_value_converter_impl.cc(387)] Getter for property selectionDirection threw an exception.


Sep 13 21:45:00 computer-di-steve [0x0-0x13013].com.google.Chrome[241]: [416:138499:0913/214500:ERROR:v8_value_converter_impl.cc(387)] Getter for property selectionEnd threw an exception.


Sep 13 21:45:00 computer-di-steve [0x0-0x13013].com.google.Chrome[241]: [416:138499:0913/214500:ERROR:v8_value_converter_impl.cc(387)] Getter for property selectionStart threw an exception.


Sep 13 21:45:00 computer-di-steve [0x0-0x13013].com.google.Chrome[241]: [416:138499:0913/214500:ERROR:v8_value_converter_impl.cc(387)] Getter for property selectionDirection threw an exception.


Sep 13 21:45:00 computer-di-steve [0x0-0x13013].com.google.Chrome[241]: [416:138499:0913/214500:ERROR:v8_value_converter_impl.cc(387)] Getter for property selectionEnd threw an exception.


Sep 13 21:45:00 computer-di-steve [0x0-0x13013].com.google.Chrome[241]: [416:138499:0913/214500:ERROR:v8_value_converter_impl.cc(387)] Getter for property selectionStart threw an exception.


Sep 13 21:45:00 computer-di-steve [0x0-0x13013].com.google.Chrome[241]: [416:138499:0913/214500:ERROR:v8_value_converter_impl.cc(387)] Getter for property selectionDirection threw an exception.


Sep 13 21:45:00 computer-di-steve [0x0-0x13013].com.google.Chrome[241]: [416:138499:0913/214500:ERROR:v8_value_converter_impl.cc(387)] Getter for property selectionEnd threw an exception.


Sep 13 21:45:00 computer-di-steve [0x0-0x13013].com.google.Chrome[241]: [416:138499:0913/214500:ERROR:v8_value_converter_impl.cc(387)] Getter for property selectionStart threw an exception.


Sep 13 21:45:00 computer-di-steve [0x0-0x13013].com.google.Chrome[241]: [416:138499:0913/214500:ERROR:v8_value_converter_impl.cc(387)] Getter for property selectionDirection threw an exception.


Sep 13 21:45:00 computer-di-steve [0x0-0x13013].com.google.Chrome[241]: [416:138499:0913/214500:ERROR:v8_value_converter_impl.cc(387)] Getter for property selectionEnd threw an exception.


Sep 13 21:45:00 computer-di-steve [0x0-0x13013].com.google.Chrome[241]: [416:138499:0913/214500:ERROR:v8_value_converter_impl.cc(387)] Getter for property selectionStart threw an exception.


Sep 13 21:45:00 computer-di-steve [0x0-0x13013].com.google.Chrome[241]: [416:138499:0913/214500:ERROR:v8_value_converter_impl.cc(387)] Getter for property selectionDirection threw an exception.


Sep 13 21:45:00 computer-di-steve [0x0-0x13013].com.google.Chrome[241]: [416:138499:0913/214500:ERROR:v8_value_converter_impl.cc(387)] Getter for property selectionEnd threw an exception.


Sep 13 21:45:00 computer-di-steve [0x0-0x13013].com.google.Chrome[241]: [416:138499:0913/214500:ERROR:v8_value_converter_impl.cc(387)] Getter for property selectionStart threw an exception.


Sep 13 21:45:00 computer-di-steve [0x0-0x13013].com.google.Chrome[241]: [416:138499:0913/214500:ERROR:v8_value_converter_impl.cc(387)] Getter for property selectionDirection threw an exception.


Sep 13 21:45:00 computer-di-steve [0x0-0x13013].com.google.Chrome[241]: [416:138499:0913/214500:ERROR:v8_value_converter_impl.cc(387)] Getter for property selectionEnd threw an exception.


Sep 13 21:45:00 computer-di-steve [0x0-0x13013].com.google.Chrome[241]: [416:138499:0913/214500:ERROR:v8_value_converter_impl.cc(387)] Getter for property selectionStart threw an exception.


Sep 13 21:45:00 computer-di-steve [0x0-0x13013].com.google.Chrome[241]: [416:138499:0913/214500:ERROR:v8_value_converter_impl.cc(387)] Getter for property selectionDirection threw an exception.


Sep 13 21:45:00 computer-di-steve [0x0-0x13013].com.google.Chrome[241]: [416:138499:0913/214500:ERROR:v8_value_converter_impl.cc(387)] Getter for property selectionEnd threw an exception.


Sep 13 21:45:00 computer-di-steve [0x0-0x13013].com.google.Chrome[241]: [416:138499:0913/214500:ERROR:v8_value_converter_impl.cc(387)] Getter for property selectionStart threw an exception.


Sep 13 21:45:00 computer-di-steve [0x0-0x13013].com.google.Chrome[241]: [416:138499:0913/214500:ERROR:v8_value_converter_impl.cc(387)] Getter for property selectionDirection threw an exception.


Sep 13 21:45:00 computer-di-steve [0x0-0x13013].com.google.Chrome[241]: [416:138499:0913/214500:ERROR:v8_value_converter_impl.cc(387)] Getter for property selectionEnd threw an exception.


Sep 13 21:45:00 computer-di-steve [0x0-0x13013].com.google.Chrome[241]: [416:138499:0913/214500:ERROR:v8_value_converter_impl.cc(387)] Getter for property selectionStart threw an exception.


Sep 13 21:45:00 computer-di-steve [0x0-0x13013].com.google.Chrome[241]: [416:138499:0913/214500:ERROR:v8_value_converter_impl.cc(387)] Getter for property selectionDirection threw an exception.


Sep 13 21:45:00 computer-di-steve [0x0-0x13013].com.google.Chrome[241]: [416:138499:0913/214500:ERROR:v8_value_converter_impl.cc(387)] Getter for property selectionEnd threw an exception.


Sep 13 21:45:00 computer-di-steve [0x0-0x13013].com.google.Chrome[241]: [416:138499:0913/214500:ERROR:v8_value_converter_impl.cc(387)] Getter for property selectionStart threw an exception.


Sep 13 21:47:36 computer-di-steve [0x0-0x13013].com.google.Chrome[241]: [241:138499:0913/214735:ERROR:audio_manager_base.cc(244)] Invalid audio output parameters received; using fake audio path. Channels: 2, Sample Rate: 0, Bits Per Sample: 16, Frames Per Buffer: 128


Sep 13 21:47:47 computer-di-steve [0x0-0x13013].com.google.Chrome[241]: [241:138499:0913/214747:ERROR:render_widget_host_view_mac.mm(1255)] Failed SetIOSurface on CompositingIOSurfaceMac


Sep 13 21:47:50 computer-di-steve [0x0-0x13013].com.google.Chrome[241]: [241:138499:0913/214750:ERROR:render_widget_host_view_mac.mm(1255)] Failed SetIOSurface on CompositingIOSurfaceMac


Sep 13 21:47:52 computer-di-steve [0x0-0x13013].com.google.Chrome[241]: [241:138499:0913/214752:ERROR:render_widget_host_view_mac.mm(1255)] Failed SetIOSurface on CompositingIOSurfaceMac


Sep 13 21:47:53 computer-di-steve [0x0-0x13013].com.google.Chrome[241]: [241:138499:0913/214753:ERROR:render_widget_host_view_mac.mm(1255)] Failed SetIOSurface on CompositingIOSurfaceMac


Sep 13 21:47:59 computer-di-steve [0x0-0x13013].com.google.Chrome[241]: [241:138499:0913/214759:ERROR:audio_manager_base.cc(244)] Invalid audio output parameters received; using fake audio path. Channels: 2, Sample Rate: 0, Bits Per Sample: 16, Frames Per Buffer: 128


Sep 13 21:48:02 computer-di-steve [0x0-0x13013].com.google.Chrome[241]: Sep 13 21:48:02 computer-di-steve.local Google Chrome Helper[289] <Error>: displayRGB : CMSCreateDisplayProfile: returned 0


Sep 13 21:48:02 computer-di-steve [0x0-0x13013].com.google.Chrome[241]: Sep 13 21:48:02 computer-di-steve.local Google Chrome Helper[289] <Error>: CMSCreateDataProviderOrGetInfo : Malformed colorspace


Sep 13 21:48:02 computer-di-steve [0x0-0x13013].com.google.Chrome[241]: Sep 13 21:48:02 computer-di-steve.local Google Chrome Helper[289] <Error>: displayRGB : CMSCreateDisplayProfile: returned 0


Sep 13 21:48:05 computer-di-steve [0x0-0x13013].com.google.Chrome[241]: Sep 13 21:48:05 computer-di-steve.local Google Chrome Helper[289] <Error>: ripc_GetColor - CGColorTransformConvertColorFloatComponents failed


Sep 13 21:48:06 computer-di-steve [0x0-0x13013].com.google.Chrome[241]: Sep 13 21:48:06 computer-di-steve.local Google Chrome Helper[289] <Error>: displayRGB : CMSCreateDisplayProfile: returned 0


Sep 13 21:48:06 computer-di-steve [0x0-0x13013].com.google.Chrome[241]: Sep 13 21:48:06 computer-di-steve.local Google Chrome Helper[289] <Error>: ripc_GetColor - CGColorTransformConvertColorFloatComponents failed


Sep 13 21:48:16: --- last message repeated 14 times ---


Sep 13 21:48:16 computer-di-steve [0x0-0x13013].com.google.Chrome[241]: [241:138499:0913/214816:ERROR:render_widget_host_view_mac.mm(1255)] Failed SetIOSurface on CompositingIOSurfaceMac


Sep 13 21:48:24: --- last message repeated 1 time ---


Sep 13 21:48:24 computer-di-steve [0x0-0x13013].com.google.Chrome[241]: [241:138499:0913/214824:ERROR:render_widget_host_view_mac.mm(1255)] Failed SetIOSurface on CompositingIOSurfaceMac


Sep 13 21:49:06: --- last message repeated 1 time ---


Sep 13 21:49:13 computer-di-steve [0x0-0x13013].com.google.Chrome[241]: [241:138499:0913/214913:ERROR:audio_manager_base.cc(244)] Invalid audio output parameters received; using fake audio path. Channels: 2, Sample Rate: 0, Bits Per Sample: 16, Frames Per Buffer: 128


Sep 13 21:49:43 computer-di-steve [0x0-0x13013].com.google.Chrome[241]: [241:138499:0913/214943:ERROR:audio_manager_base.cc(244)] Invalid audio output parameters received; using fake audio path. Channels: 2, Sample Rate: 0, Bits Per Sample: 16, Frames Per Buffer: 128


Sep 13 21:50:27 computer-di-steve [0x0-0x13013].com.google.Chrome[241]: [241:138499:0913/215027:ERROR:render_widget_host_view_mac.mm(1255)] Failed SetIOSurface on CompositingIOSurfaceMac


Sep 13 21:50:28 computer-di-steve [0x0-0x13013].com.google.Chrome[241]: [241:138499:0913/215028:ERROR:render_widget_host_view_mac.mm(1255)] Failed SetIOSurface on CompositingIOSurfaceMac


Sep 13 21:50:29: --- last message repeated 13 times ---


Sep 13 21:50:29 computer-di-steve [0x0-0x13013].com.google.Chrome[241]: [241:138499:0913/215029:ERROR:render_widget_host_view_mac.mm(1255)] Failed SetIOSurface on CompositingIOSurfaceMac


Sep 13 21:50:30: --- last message repeated 9 times ---


Sep 13 21:50:30 computer-di-steve [0x0-0x13013].com.google.Chrome[241]: [241:138499:0913/215030:ERROR:render_widget_host_view_mac.mm(1255)] Failed SetIOSurface on CompositingIOSurfaceMac


Sep 13 21:50:34: --- last message repeated 1 time ---


Sep 13 21:50:34 computer-di-steve [0x0-0x13013].com.google.Chrome[241]: [241:138499:0913/215034:ERROR:render_widget_host_view_mac.mm(1255)] Failed SetIOSurface on CompositingIOSurfaceMac


Sep 13 21:50:35: --- last message repeated 10 times ---


Sep 13 21:50:35 computer-di-steve [0x0-0x13013].com.google.Chrome[241]: [241:138499:0913/215035:ERROR:render_widget_host_view_mac.mm(1255)] Failed SetIOSurface on CompositingIOSurfaceMac


Sep 13 21:50:37 computer-di-steve [0x0-0x13013].com.google.Chrome[241]: [241:138499:0913/215037:ERROR:audio_manager_base.cc(244)] Invalid audio output parameters received; using fake audio path. Channels: 2, Sample Rate: 0, Bits Per Sample: 16, Frames Per Buffer: 128


Sep 13 21:51:08 computer-di-steve [0x0-0x13013].com.google.Chrome[241]: [241:138499:0913/215108:ERROR:audio_manager_base.cc(244)] Invalid audio output parameters received; using fake audio path. Channels: 2, Sample Rate: 0, Bits Per Sample: 16, Frames Per Buffer: 128


Sep 13 21:51:11 computer-di-steve [0x0-0x13013].com.google.Chrome[241]: [241:138499:0913/215111:ERROR:render_widget_host_view_mac.mm(1255)] Failed SetIOSurface on CompositingIOSurfaceMac


Sep 13 21:51:16 computer-di-steve [0x0-0x13013].com.google.Chrome[241]: [241:138499:0913/215116:ERROR:render_widget_host_view_mac.mm(1255)] Failed SetIOSurface on CompositingIOSurfaceMac


Sep 13 21:51:52 computer-di-steve [0x0-0x13013].com.google.Chrome[241]: [241:138499:0913/215152:ERROR:audio_manager_base.cc(244)] Invalid audio output parameters received; using fake audio path. Channels: 2, Sample Rate: 0, Bits Per Sample: 16, Frames Per Buffer: 128


Sep 13 21:52:14 computer-di-steve [0x0-0x13013].com.google.Chrome[241]: [427:138499:0913/215214:ERROR:v8_value_converter_impl.cc(387)] Getter for property selectionDirection threw an exception.


Sep 13 21:52:14 computer-di-steve [0x0-0x13013].com.google.Chrome[241]: [427:138499:0913/215214:ERROR:v8_value_converter_impl.cc(387)] Getter for property selectionEnd threw an exception.


Sep 13 21:52:14 computer-di-steve [0x0-0x13013].com.google.Chrome[241]: [427:138499:0913/215214:ERROR:v8_value_converter_impl.cc(387)] Getter for property selectionStart threw an exception.


Sep 13 21:52:14 computer-di-steve [0x0-0x13013].com.google.Chrome[241]: [427:138499:0913/215214:ERROR:v8_value_converter_impl.cc(387)] Getter for property selectionDirection threw an exception.


Sep 13 21:52:14 computer-di-steve [0x0-0x13013].com.google.Chrome[241]: [427:138499:0913/215214:ERROR:v8_value_converter_impl.cc(387)] Getter for property selectionEnd threw an exception.


Sep 13 21:52:14 computer-di-steve [0x0-0x13013].com.google.Chrome[241]: [427:138499:0913/215214:ERROR:v8_value_converter_impl.cc(387)] Getter for property selectionStart threw an exception.


Sep 13 21:52:14 computer-di-steve [0x0-0x13013].com.google.Chrome[241]: [427:138499:0913/215214:ERROR:v8_value_converter_impl.cc(387)] Getter for property selectionDirection threw an exception.


Sep 13 21:52:14 computer-di-steve [0x0-0x13013].com.google.Chrome[241]: [427:138499:0913/215214:ERROR:v8_value_converter_impl.cc(387)] Getter for property selectionEnd threw an exception.


Sep 13 21:52:14 computer-di-steve [0x0-0x13013].com.google.Chrome[241]: [427:138499:0913/215214:ERROR:v8_value_converter_impl.cc(387)] Getter for property selectionStart threw an exception.


Sep 13 21:52:14 computer-di-steve [0x0-0x13013].com.google.Chrome[241]: [427:138499:0913/215214:ERROR:v8_value_converter_impl.cc(387)] Getter for property selectionDirection threw an exception.


Sep 13 21:52:14 computer-di-steve [0x0-0x13013].com.google.Chrome[241]: [427:138499:0913/215214:ERROR:v8_value_converter_impl.cc(387)] Getter for property selectionEnd threw an exception.


Sep 13 21:52:14 computer-di-steve [0x0-0x13013].com.google.Chrome[241]: [427:138499:0913/215214:ERROR:v8_value_converter_impl.cc(387)] Getter for property selectionStart threw an exception.


Sep 13 21:52:14 computer-di-steve [0x0-0x13013].com.google.Chrome[241]: [427:138499:0913/215214:ERROR:v8_value_converter_impl.cc(387)] Getter for property selectionDirection threw an exception.


Sep 13 21:52:14 computer-di-steve [0x0-0x13013].com.google.Chrome[241]: [427:138499:0913/215214:ERROR:v8_value_converter_impl.cc(387)] Getter for property selectionEnd threw an exception.


Sep 13 21:52:14 computer-di-steve [0x0-0x13013].com.google.Chrome[241]: [427:138499:0913/215214:ERROR:v8_value_converter_impl.cc(387)] Getter for property selectionStart threw an exception.


Sep 13 21:52:14 computer-di-steve [0x0-0x13013].com.google.Chrome[241]: [427:138499:0913/215214:ERROR:v8_value_converter_impl.cc(387)] Getter for property selectionDirection threw an exception.


Sep 13 21:52:14 computer-di-steve [0x0-0x13013].com.google.Chrome[241]: [427:138499:0913/215214:ERROR:v8_value_converter_impl.cc(387)] Getter for property selectionEnd threw an exception.


Sep 13 21:52:14 computer-di-steve [0x0-0x13013].com.google.Chrome[241]: [427:138499:0913/215214:ERROR:v8_value_converter_impl.cc(387)] Getter for property selectionStart threw an exception.


Sep 13 21:52:14 computer-di-steve [0x0-0x13013].com.google.Chrome[241]: [427:138499:0913/215214:ERROR:v8_value_converter_impl.cc(387)] Getter for property selectionDirection threw an exception.


Sep 13 21:52:14 computer-di-steve [0x0-0x13013].com.google.Chrome[241]: [427:138499:0913/215214:ERROR:v8_value_converter_impl.cc(387)] Getter for property selectionEnd threw an exception.


Sep 13 21:52:14 computer-di-steve [0x0-0x13013].com.google.Chrome[241]: [427:138499:0913/215214:ERROR:v8_value_converter_impl.cc(387)] Getter for property selectionStart threw an exception.


Sep 13 21:52:14 computer-di-steve [0x0-0x13013].com.google.Chrome[241]: [427:138499:0913/215214:ERROR:v8_value_converter_impl.cc(387)] Getter for property selectionDirection threw an exception.


Sep 13 21:52:14 computer-di-steve [0x0-0x13013].com.google.Chrome[241]: [427:138499:0913/215214:ERROR:v8_value_converter_impl.cc(387)] Getter for property selectionEnd threw an exception.


Sep 13 21:52:14 computer-di-steve [0x0-0x13013].com.google.Chrome[241]: [427:138499:0913/215214:ERROR:v8_value_converter_impl.cc(387)] Getter for property selectionStart threw an exception.


Sep 13 21:52:15 computer-di-steve [0x0-0x13013].com.google.Chrome[241]: [427:138499:0913/215215:ERROR:v8_value_converter_impl.cc(387)] Getter for property selectionDirection threw an exception.


Sep 13 21:52:15 computer-di-steve [0x0-0x13013].com.google.Chrome[241]: [427:138499:0913/215215:ERROR:v8_value_converter_impl.cc(387)] Getter for property selectionEnd threw an exception.


Sep 13 21:52:15 computer-di-steve [0x0-0x13013].com.google.Chrome[241]: [427:138499:0913/215215:ERROR:v8_value_converter_impl.cc(387)] Getter for property selectionStart threw an exception.


Sep 13 21:52:15 computer-di-steve [0x0-0x13013].com.google.Chrome[241]: [427:138499:0913/215215:ERROR:v8_value_converter_impl.cc(387)] Getter for property selectionDirection threw an exception.


Sep 13 21:52:15 computer-di-steve [0x0-0x13013].com.google.Chrome[241]: [427:138499:0913/215215:ERROR:v8_value_converter_impl.cc(387)] Getter for property selectionEnd threw an exception.


Sep 13 21:52:15 computer-di-steve [0x0-0x13013].com.google.Chrome[241]: [427:138499:0913/215215:ERROR:v8_value_converter_impl.cc(387)] Getter for property selectionStart threw an exception.


Sep 13 21:52:15 computer-di-steve [0x0-0x13013].com.google.Chrome[241]: [427:138499:0913/215215:ERROR:v8_value_converter_impl.cc(387)] Getter for property selectionDirection threw an exception.


Sep 13 21:52:15 computer-di-steve [0x0-0x13013].com.google.Chrome[241]: [427:138499:0913/215215:ERROR:v8_value_converter_impl.cc(387)] Getter for property selectionEnd threw an exception.


Sep 13 21:52:15 computer-di-steve [0x0-0x13013].com.google.Chrome[241]: [427:138499:0913/215215:ERROR:v8_value_converter_impl.cc(387)] Getter for property selectionStart threw an exception.


Sep 13 21:52:15 computer-di-steve [0x0-0x13013].com.google.Chrome[241]: [427:138499:0913/215215:ERROR:v8_value_converter_impl.cc(387)] Getter for property selectionDirection threw an exception.


Sep 13 21:52:15 computer-di-steve [0x0-0x13013].com.google.Chrome[241]: [427:138499:0913/215215:ERROR:v8_value_converter_impl.cc(387)] Getter for property selectionEnd threw an exception.


Sep 13 21:52:15 computer-di-steve [0x0-0x13013].com.google.Chrome[241]: [427:138499:0913/215215:ERROR:v8_value_converter_impl.cc(387)] Getter for property selectionStart threw an exception.


Sep 13 21:52:15 computer-di-steve [0x0-0x13013].com.google.Chrome[241]: [427:138499:0913/215215:ERROR:v8_value_converter_impl.cc(387)] Getter for property selectionDirection threw an exception.


Sep 13 21:52:15 computer-di-steve [0x0-0x13013].com.google.Chrome[241]: [427:138499:0913/215215:ERROR:v8_value_converter_impl.cc(387)] Getter for property selectionEnd threw an exception.


Sep 13 21:52:15 computer-di-steve [0x0-0x13013].com.google.Chrome[241]: [427:138499:0913/215215:ERROR:v8_value_converter_impl.cc(387)] Getter for property selectionStart threw an exception.


Sep 13 21:52:15 computer-di-steve [0x0-0x13013].com.google.Chrome[241]: [427:138499:0913/215215:ERROR:v8_value_converter_impl.cc(387)] Getter for property selectionDirection threw an exception.


Sep 13 21:52:15 computer-di-steve [0x0-0x13013].com.google.Chrome[241]: [427:138499:0913/215215:ERROR:v8_value_converter_impl.cc(387)] Getter for property selectionEnd threw an exception.


Sep 13 21:52:15 computer-di-steve [0x0-0x13013].com.google.Chrome[241]: [427:138499:0913/215215:ERROR:v8_value_converter_impl.cc(387)] Getter for property selectionStart threw an exception.


Sep 13 21:52:15 computer-di-steve [0x0-0x13013].com.google.Chrome[241]: [427:138499:0913/215215:ERROR:v8_value_converter_impl.cc(387)] Getter for property selectionDirection threw an exception.


Sep 13 21:52:15 computer-di-steve [0x0-0x13013].com.google.Chrome[241]: [427:138499:0913/215215:ERROR:v8_value_converter_impl.cc(387)] Getter for property selectionEnd threw an exception.


Sep 13 21:52:15 computer-di-steve [0x0-0x13013].com.google.Chrome[241]: [427:138499:0913/215215:ERROR:v8_value_converter_impl.cc(387)] Getter for property selectionStart threw an exception.


Sep 13 21:52:15 computer-di-steve [0x0-0x13013].com.google.Chrome[241]: [427:138499:0913/215215:ERROR:v8_value_converter_impl.cc(387)] Getter for property selectionDirection threw an exception.


Sep 13 21:52:15 computer-di-steve [0x0-0x13013].com.google.Chrome[241]: [427:138499:0913/215215:ERROR:v8_value_converter_impl.cc(387)] Getter for property selectionEnd threw an exception.


Sep 13 21:52:15 computer-di-steve [0x0-0x13013].com.google.Chrome[241]: [427:138499:0913/215215:ERROR:v8_value_converter_impl.cc(387)] Getter for property selectionStart threw an exception.


Sep 13 21:52:15 computer-di-steve [0x0-0x13013].com.google.Chrome[241]: [427:138499:0913/215215:ERROR:v8_value_converter_impl.cc(387)] Getter for property selectionDirection threw an exception.


Sep 13 21:52:15 computer-di-steve [0x0-0x13013].com.google.Chrome[241]: [427:138499:0913/215215:ERROR:v8_value_converter_impl.cc(387)] Getter for property selectionEnd threw an exception.


Sep 13 21:52:15 computer-di-steve [0x0-0x13013].com.google.Chrome[241]: [427:138499:0913/215215:ERROR:v8_value_converter_impl.cc(387)] Getter for property selectionStart threw an exception.


Sep 13 21:52:15 computer-di-steve [0x0-0x13013].com.google.Chrome[241]: [427:138499:0913/215215:ERROR:v8_value_converter_impl.cc(387)] Getter for property selectionDirection threw an exception.


Sep 13 21:52:15 computer-di-steve [0x0-0x13013].com.google.Chrome[241]: [427:138499:0913/215215:ERROR:v8_value_converter_impl.cc(387)] Getter for property selectionEnd threw an exception.


Sep 13 21:52:15 computer-di-steve [0x0-0x13013].com.google.Chrome[241]: [427:138499:0913/215215:ERROR:v8_value_converter_impl.cc(387)] Getter for property selectionStart threw an exception.


Sep 13 21:52:15 computer-di-steve [0x0-0x13013].com.google.Chrome[241]: [427:138499:0913/215215:ERROR:v8_value_converter_impl.cc(387)] Getter for property selectionDirection threw an exception.


Sep 13 21:52:15 computer-di-steve [0x0-0x13013].com.google.Chrome[241]: [427:138499:0913/215215:ERROR:v8_value_converter_impl.cc(387)] Getter for property selectionEnd threw an exception.


Sep 13 21:52:15 computer-di-steve [0x0-0x13013].com.google.Chrome[241]: [427:138499:0913/215215:ERROR:v8_value_converter_impl.cc(387)] Getter for property selectionStart threw an exception.


Sep 13 21:52:15 computer-di-steve [0x0-0x13013].com.google.Chrome[241]: [427:138499:0913/215215:ERROR:v8_value_converter_impl.cc(387)] Getter for property selectionDirection threw an exception.


Sep 13 21:52:15 computer-di-steve [0x0-0x13013].com.google.Chrome[241]: [427:138499:0913/215215:ERROR:v8_value_converter_impl.cc(387)] Getter for property selectionEnd threw an exception.


Sep 13 21:52:15 computer-di-steve [0x0-0x13013].com.google.Chrome[241]: [427:138499:0913/215215:ERROR:v8_value_converter_impl.cc(387)] Getter for property selectionStart threw an exception.


Sep 13 21:52:15 computer-di-steve [0x0-0x13013].com.google.Chrome[241]: [427:138499:0913/215215:ERROR:v8_value_converter_impl.cc(387)] Getter for property selectionDirection threw an exception.


Sep 13 21:52:15 computer-di-steve [0x0-0x13013].com.google.Chrome[241]: [427:138499:0913/215215:ERROR:v8_value_converter_impl.cc(387)] Getter for property selectionEnd threw an exception.


Sep 13 21:52:15 computer-di-steve [0x0-0x13013].com.google.Chrome[241]: [427:138499:0913/215215:ERROR:v8_value_converter_impl.cc(387)] Getter for property selectionStart threw an exception.


Sep 13 21:52:15 computer-di-steve [0x0-0x13013].com.google.Chrome[241]: [427:138499:0913/215215:ERROR:v8_value_converter_impl.cc(387)] Getter for property selectionDirection threw an exception.


Sep 13 21:52:15 computer-di-steve [0x0-0x13013].com.google.Chrome[241]: [427:138499:0913/215215:ERROR:v8_value_converter_impl.cc(387)] Getter for property selectionEnd threw an exception.


Sep 13 21:52:15 computer-di-steve [0x0-0x13013].com.google.Chrome[241]: [427:138499:0913/215215:ERROR:v8_value_converter_impl.cc(387)] Getter for property selectionStart threw an exception.


Sep 13 21:52:15 computer-di-steve [0x0-0x13013].com.google.Chrome[241]: [427:138499:0913/215215:ERROR:v8_value_converter_impl.cc(387)] Getter for property selectionDirection threw an exception.


Sep 13 21:52:15 computer-di-steve [0x0-0x13013].com.google.Chrome[241]: [427:138499:0913/215215:ERROR:v8_value_converter_impl.cc(387)] Getter for property selectionEnd threw an exception.


Sep 13 21:52:15 computer-di-steve [0x0-0x13013].com.google.Chrome[241]: [427:138499:0913/215215:ERROR:v8_value_converter_impl.cc(387)] Getter for property selectionStart threw an exception.


Sep 13 21:52:15 computer-di-steve [0x0-0x13013].com.google.Chrome[241]: [427:138499:0913/215215:ERROR:v8_value_converter_impl.cc(387)] Getter for property selectionDirection threw an exception.


Sep 13 21:52:15 computer-di-steve [0x0-0x13013].com.google.Chrome[241]: [427:138499:0913/215215:ERROR:v8_value_converter_impl.cc(387)] Getter for property selectionEnd threw an exception.


Sep 13 21:52:15 computer-di-steve [0x0-0x13013].com.google.Chrome[241]: [427:138499:0913/215215:ERROR:v8_value_converter_impl.cc(387)] Getter for property selectionStart threw an exception.


Sep 13 21:52:15 computer-di-steve [0x0-0x13013].com.google.Chrome[241]: [427:138499:0913/215215:ERROR:v8_value_converter_impl.cc(387)] Getter for property selectionDirection threw an exception.


Sep 13 21:52:15 computer-di-steve [0x0-0x13013].com.google.Chrome[241]: [427:138499:0913/215215:ERROR:v8_value_converter_impl.cc(387)] Getter for property selectionEnd threw an exception.


Sep 13 21:52:15 computer-di-steve [0x0-0x13013].com.google.Chrome[241]: [427:138499:0913/215215:ERROR:v8_value_converter_impl.cc(387)] Getter for property selectionStart threw an exception.


Sep 13 21:52:16 computer-di-steve [0x0-0x13013].com.google.Chrome[241]: [427:138499:0913/215216:ERROR:v8_value_converter_impl.cc(387)] Getter for property selectionDirection threw an exception.


Sep 13 21:52:16 computer-di-steve [0x0-0x13013].com.google.Chrome[241]: [427:138499:0913/215216:ERROR:v8_value_converter_impl.cc(387)] Getter for property selectionEnd threw an exception.


Sep 13 21:52:16 computer-di-steve [0x0-0x13013].com.google.Chrome[241]: [427:138499:0913/215216:ERROR:v8_value_converter_impl.cc(387)] Getter for property selectionStart threw an exception.


Sep 13 21:52:16 computer-di-steve [0x0-0x13013].com.google.Chrome[241]: [427:138499:0913/215216:ERROR:v8_value_converter_impl.cc(387)] Getter for property selectionDirection threw an exception.


Sep 13 21:52:16 computer-di-steve [0x0-0x13013].com.google.Chrome[241]: [427:138499:0913/215216:ERROR:v8_value_converter_impl.cc(387)] Getter for property selectionEnd threw an exception.


Sep 13 21:52:16 computer-di-steve [0x0-0x13013].com.google.Chrome[241]: [427:138499:0913/215216:ERROR:v8_value_converter_impl.cc(387)] Getter for property selectionStart threw an exception.


Sep 13 21:52:16 computer-di-steve [0x0-0x13013].com.google.Chrome[241]: [427:138499:0913/215216:ERROR:v8_value_converter_impl.cc(387)] Getter for property selectionDirection threw an exception.


Sep 13 21:52:16 computer-di-steve [0x0-0x13013].com.google.Chrome[241]: [427:138499:0913/215216:ERROR:v8_value_converter_impl.cc(387)] Getter for property selectionEnd threw an exception.


Sep 13 21:52:16 computer-di-steve [0x0-0x13013].com.google.Chrome[241]: [427:138499:0913/215216:ERROR:v8_value_converter_impl.cc(387)] Getter for property selectionStart threw an exception.


Sep 13 21:52:16 computer-di-steve [0x0-0x13013].com.google.Chrome[241]: [427:138499:0913/215216:ERROR:v8_value_converter_impl.cc(387)] Getter for property selectionDirection threw an exception.


Sep 13 21:52:16 computer-di-steve [0x0-0x13013].com.google.Chrome[241]: [427:138499:0913/215216:ERROR:v8_value_converter_impl.cc(387)] Getter for property selectionEnd threw an exception.


Sep 13 21:52:16 computer-di-steve [0x0-0x13013].com.google.Chrome[241]: [427:138499:0913/215216:ERROR:v8_value_converter_impl.cc(387)] Getter for property selectionStart threw an exception.


Sep 13 21:52:16 computer-di-steve [0x0-0x13013].com.google.Chrome[241]: [427:138499:0913/215216:ERROR:v8_value_converter_impl.cc(387)] Getter for property selectionDirection threw an exception.


Sep 13 21:52:16 computer-di-steve [0x0-0x13013].com.google.Chrome[241]: [427:138499:0913/215216:ERROR:v8_value_converter_impl.cc(387)] Getter for property selectionEnd threw an exception.


Sep 13 21:52:16 computer-di-steve [0x0-0x13013].com.google.Chrome[241]: [427:138499:0913/215216:ERROR:v8_value_converter_impl.cc(387)] Getter for property selectionStart threw an exception.


Sep 13 21:52:16 computer-di-steve [0x0-0x13013].com.google.Chrome[241]: [427:138499:0913/215216:ERROR:v8_value_converter_impl.cc(387)] Getter for property selectionDirection threw an exception.


Sep 13 21:52:16 computer-di-steve [0x0-0x13013].com.google.Chrome[241]: [427:138499:0913/215216:ERROR:v8_value_converter_impl.cc(387)] Getter for property selectionEnd threw an exception.


Sep 13 21:52:16 computer-di-steve [0x0-0x13013].com.google.Chrome[241]: [427:138499:0913/215216:ERROR:v8_value_converter_impl.cc(387)] Getter for property selectionStart threw an exception.


Sep 13 21:52:16 computer-di-steve [0x0-0x13013].com.google.Chrome[241]: [427:138499:0913/215216:ERROR:v8_value_converter_impl.cc(387)] Getter for property selectionDirection threw an exception.


Sep 13 21:52:16 computer-di-steve [0x0-0x13013].com.google.Chrome[241]: [427:138499:0913/215216:ERROR:v8_value_converter_impl.cc(387)] Getter for property selectionEnd threw an exception.


Sep 13 21:52:16 computer-di-steve [0x0-0x13013].com.google.Chrome[241]: [427:138499:0913/215216:ERROR:v8_value_converter_impl.cc(387)] Getter for property selectionStart threw an exception.


Sep 13 21:52:16 computer-di-steve [0x0-0x13013].com.google.Chrome[241]: [427:138499:0913/215216:ERROR:v8_value_converter_impl.cc(387)] Getter for property selectionDirection threw an exception.


Sep 13 21:52:16 computer-di-steve [0x0-0x13013].com.google.Chrome[241]: [427:138499:0913/215216:ERROR:v8_value_converter_impl.cc(387)] Getter for property selectionEnd threw an exception.


Sep 13 21:52:16 computer-di-steve [0x0-0x13013].com.google.Chrome[241]: [427:138499:0913/215216:ERROR:v8_value_converter_impl.cc(387)] Getter for property selectionStart threw an exception.


Sep 13 21:52:16 computer-di-steve [0x0-0x13013].com.google.Chrome[241]: [427:138499:0913/215216:ERROR:v8_value_converter_impl.cc(387)] Getter for property selectionDirection threw an exception.


Sep 13 21:52:16 computer-di-steve [0x0-0x13013].com.google.Chrome[241]: [427:138499:0913/215216:ERROR:v8_value_converter_impl.cc(387)] Getter for property selectionEnd threw an exception.


Sep 13 21:52:16 computer-di-steve [0x0-0x13013].com.google.Chrome[241]: [427:138499:0913/215216:ERROR:v8_value_converter_impl.cc(387)] Getter for property selectionStart threw an exception.


Sep 13 21:52:16 computer-di-steve [0x0-0x13013].com.google.Chrome[241]: [427:138499:0913/215216:ERROR:v8_value_converter_impl.cc(387)] Getter for property selectionDirection threw an exception.


Sep 13 21:52:16 computer-di-steve [0x0-0x13013].com.google.Chrome[241]: [427:138499:0913/215216:ERROR:v8_value_converter_impl.cc(387)] Getter for property selectionEnd threw an exception.


Sep 13 21:52:16 computer-di-steve [0x0-0x13013].com.google.Chrome[241]: [427:138499:0913/215216:ERROR:v8_value_converter_impl.cc(387)] Getter for property selectionStart threw an exception.


Sep 13 21:52:16 computer-di-steve [0x0-0x13013].com.google.Chrome[241]: [427:138499:0913/215216:ERROR:v8_value_converter_impl.cc(387)] Getter for property selectionDirection threw an exception.


Sep 13 21:52:16 computer-di-steve [0x0-0x13013].com.google.Chrome[241]: [427:138499:0913/215216:ERROR:v8_value_converter_impl.cc(387)] Getter for property selectionEnd threw an exception.


Sep 13 21:52:16 computer-di-steve [0x0-0x13013].com.google.Chrome[241]: [427:138499:0913/215216:ERROR:v8_value_converter_impl.cc(387)] Getter for property selectionStart threw an exception.


Sep 13 21:52:16 computer-di-steve [0x0-0x13013].com.google.Chrome[241]: [427:138499:0913/215216:ERROR:v8_value_converter_impl.cc(387)] Getter for property selectionDirection threw an exception.


Sep 13 21:52:16 computer-di-steve [0x0-0x13013].com.google.Chrome[241]: [427:138499:0913/215216:ERROR:v8_value_converter_impl.cc(387)] Getter for property selectionEnd threw an exception.


Sep 13 21:52:16 computer-di-steve [0x0-0x13013].com.google.Chrome[241]: [427:138499:0913/215216:ERROR:v8_value_converter_impl.cc(387)] Getter for property selectionStart threw an exception.


Sep 13 21:52:16 computer-di-steve [0x0-0x13013].com.google.Chrome[241]: [427:138499:0913/215216:ERROR:v8_value_converter_impl.cc(387)] Getter for property selectionDirection threw an exception.


Sep 13 21:52:16 computer-di-steve [0x0-0x13013].com.google.Chrome[241]: [427:138499:0913/215216:ERROR:v8_value_converter_impl.cc(387)] Getter for property selectionEnd threw an exception.


Sep 13 21:52:16 computer-di-steve [0x0-0x13013].com.google.Chrome[241]: [427:138499:0913/215216:ERROR:v8_value_converter_impl.cc(387)] Getter for property selectionStart threw an exception.


Sep 13 21:52:43 computer-di-steve [0x0-0x13013].com.google.Chrome[241]: [241:138499:0913/215243:ERROR:audio_manager_base.cc(244)] Invalid audio output parameters received; using fake audio path. Channels: 2, Sample Rate: 0, Bits Per Sample: 16, Frames Per Buffer: 128


Share this post


Link to post
Share on other sites

Per i moderatori:


Assurdo, mi ha postato quattro post uguali, con un solo clic.


Quando stavo cancellando, due sono spariti, adesso ho perso tutti i contenuti.


 


Cerco di riportare, alla meglio, quanto avevo scritto:


 


Miellino, due cose:


1) Recovery ce l'hai, è indiscutibile, riprova più volte


Non sei un eccezione e lo trovi nei tuoi stessi dati due volte:


"3: Apple_Boot Recovery HD 650.0 MB disk0s3" e "Recovery HD (disk0s3) <not mounted>: 650 MB "


 


2) i log che riportano per più di 10 righe lo stesso messaggio, NON SI COPIANO PER INTERO, vanno tagliati nelle righe uguali eccedenti.


 


Per adesso, poi dopo aver resettato Pram e riparato il disco da Recovery, riposta il tutto.


 


Elimina rigorosamente:


- McKeeper


- CleanMyDrive


- La Cie Network Assistant


 


Togli dalle applicazioni in avvio tutto, poi rimetti una per volta, se non dà problemi.


 


Disinstalla e poi reinstalla Chrome.


Le estensioni le rimetterai una per volta, a distanza e navigazione effettuata, ce n'è una che ti crea un conflitto.


 


Hai una o più applicazione per PPC, individuala ed eliminala radicalmente.


Aggiorna le applicazioni ed elimina quelle che non usi o non sono aggiornabili a Snow Leopard


Share this post


Link to post
Share on other sites

NON usare il DVD di Snow Leopard per nessuna operazione su Lion.

Sei sicuro che il tuo Mac è adatto ad ospitare Lion?

Grazie Faxus, la prossima volta posterò meglio il log e creerò se ricapita un nuovo thread.

Ok riproverò durante il boot.

È un po' lento ma ormai l'ho messo su.

Tornare indietro mi sa che è un casino.

Farò quanto mi hai detto e ti farò sapere.

Share this post


Link to post
Share on other sites

Allora ho aspettato perchè ho avuto poco tempo di usare il mac e dopo aver fatto tutto quello che mi hai detto (sono riuscito anche a fare il boot del recovery) volevo vedere come andava.


Per qualche giorno sembrava tornato perfetto poi ha ricominciato a fare blocchi improvvisi.


 


Ti riposto il log della console :


 


Oct  1 19:06:20 localhost fseventsd[17]: event logs in /.fseventsd out of sync with volume.  destroying old logs. (2935 19 176331)


Oct  1 19:06:20 localhost fseventsd[17]: log dir: /.fseventsd getting new uuid: A418D999-4895-4A0A-9D32-8559FA7060BC


Oct  1 19:06:00 localhost bootlog[0]: BOOT_TIME 1380647160 0


Oct  1 19:06:21 localhost UserEventAgent[11]: starting CaptiveNetworkSupport as SystemEventAgent built Jun 13 2011 17:29:21


Oct  1 19:06:06 localhost com.apple.launchd[1]: *** launchd[1] has started up. ***


Oct  1 19:06:20 localhost com.apple.launchd[1] (com.parallels.desktop.launchdaemon): Unknown key for boolean: HopefullyExitsFirst


Oct  1 19:06:20 localhost com.apple.launchd[1] (com.apple.powerd): Unknown value for key POSIXSpawnType: Interactive


Oct  1 19:06:20 localhost com.apple.launchd[1] (com.apple.sandboxd): Unknown value for key POSIXSpawnType: Interactive


Oct  1 19:06:21 localhost UserEventAgent[11]: WirelessAirPortDeviceNameCopy(): no BSD interface name found for object 12295


Oct  1 19:06:21 localhost UserEventAgent[11]: CaptiveNetworkSupport:CaptiveSCCopyWiFiDevices:388 WiFi Device Name == NULL


Oct  1 19:06:21 localhost UserEventAgent[11]: CertsKeychainMonitor: configuring


Oct  1 19:06:24 localhost airportd[29]: _processDLILEvent: en1 attached (down)


Oct  1 19:06:24 localhost UserEventAgent[11]: CaptiveNetworkSupport:CreateInterfaceWatchList:2788 WiFi Devices Found. :)


Oct  1 19:06:24 localhost UserEventAgent[11]: CaptiveNetworkSupport:CaptivePublishState:1211 en1 - PreProbe


Oct  1 19:06:24 localhost UserEventAgent[11]: CaptiveNetworkSupport:CaptiveSCRebuildCache:81 Failed to get service order


Oct  1 19:06:33: --- last message repeated 1 time ---


Oct  1 19:06:24 localhost UserEventAgent[11]: CaptiveNetworkSupport:CaptivePublishState:1211 en1 - PreProbe


Oct  1 19:06:24 localhost UserEventAgent[11]: CaptiveNetworkSupport:CaptiveSCRebuildCache:81 Failed to get service order


Oct  1 19:06:33: --- last message repeated 1 time ---


Oct  1 19:06:24 localhost UserEventAgent[11]: CaptiveNetworkSupport:CaptivePublishState:1211 en1 - PreProbe


Oct  1 19:06:24 localhost configd[16]: network configuration changed.


Oct  1 19:06:24 steve configd[16]: setting hostname to "steve.local"


Oct  1 19:06:28 steve mDNSResponder[12]: mDNSResponder mDNSResponder-320.16 (Jul 19 2012 21:07:07) starting OSXVers 11


Oct  1 19:06:31 steve systemkeychain[38]: done file: /var/run/systemkeychaincheck.done


Oct  1 19:06:31 steve mDNSResponder[12]: D2D_IPC: Loaded


Oct  1 19:06:31 steve mDNSResponder[12]: D2DInitialize succeeded


Oct  1 19:06:31 steve configd[16]: network configuration changed.


Oct  1 19:06:49: --- last message repeated 1 time ---


Oct  1 19:06:31 steve com.apple.ucupdate.plist[60]: ucupdate: Checked 1 update, no match found.


Oct  1 19:06:31 steve com.apple.pfctl[68]: No ALTQ support in kernel


Oct  1 19:06:31 steve com.apple.pfctl[68]: ALTQ related functions disabled


Oct  1 19:06:31 steve Parallels[106]: Loading kernel extension  prl_hypervisor.kext


Oct  1 19:06:31 steve com.apple.SystemStarter[61]: Starting up Missing Sync Listener


Oct  1 19:06:32 steve com.apple.SystemStarter[61]: Starting Asterisk PBX


Oct  1 19:06:32 steve com.apple.SystemStarter[61]: Starting Privoxy


Oct  1 19:06:32 steve com.apple.SystemStarter[61]: Starting TwonkyMedia


Oct  1 19:06:32 steve com.apple.usbmuxd[59]: usbmuxd-296.4 on Dec 21 2012 at 16:11:14, running 64 bit


Oct  1 19:06:32 steve UserEventAgent[11]: ServermgrdRegistration cannot load config data


Oct  1 19:06:32 steve privoxy[115]: Launch of "./privoxy" failed: the PowerPC architecture is no longer supported.


Oct  1 19:06:32 steve com.apple.SystemStarter[61]: 2013-10-01 19:06:32.746 RosettaNonGrata[115:12803] Launch of "./privoxy" failed: the PowerPC architecture is no longer supported.


Oct  1 19:06:32 steve SystemStarter[61]: Privoxy (102) did not complete successfully


Oct  1 19:06:33 steve Parallels[125]: Loading kernel extension  prl_hid_hook.kext


Oct  1 19:06:35 steve twonkymedia[116]: Launch of "/usr/local/mediaserver/twonkymedia" failed: the PowerPC architecture is no longer supported.


Oct  1 19:06:35 steve com.apple.SystemStarter[61]: 2013-10-01 19:06:35.707 RosettaNonGrata[116:12803] Launch of "/usr/local/mediaserver/twonkymedia" failed: the PowerPC architecture is no longer supported.


Oct  1 19:06:35 steve SystemStarter[61]: MediaServer (101) did not complete successfully


Oct  1 19:06:36 steve Parallels[132]: Loading kernel extension  prl_usb_connect.kext


Oct  1 19:06:36 steve loginwindow[72]: Login Window Application Started


Oct  1 19:06:38 steve Parallels[139]: Trying to load kernel extensions, exit status: 0


Oct  1 19:06:39 steve netbiosd[129]: Unable to start NetBIOS name service: 


Oct  1 19:06:39 steve mds[70]: (Normal) FMW: FMW 0 0


Oct  1 19:06:49 steve com.apple.locationd[73]: ERROR,Time,402340009.575,Function,"void CLDaemonCore::startRun()",locationd was started after an unclean shutdown


Oct  1 19:06:49 steve com.apple.locationd[73]: STACK,Time,402340009.576,1   locationd                           0x000000010163e254 locationd + 176724


Oct  1 19:06:49 steve com.apple.locationd[73]: STACK,Time,402340009.576,2   locationd                           0x000000010163f1c6 locationd + 180678


Oct  1 19:06:49 steve com.apple.locationd[73]: STACK,Time,402340009.576,3   locationd                           0x000000010167032c locationd + 381740


Oct  1 19:06:49 steve com.apple.locationd[73]: STACK,Time,402340009.576,4   locationd                           0x0000000101614fd8 locationd + 8152


Oct  1 19:06:49 steve com.apple.locationd[73]: STACK,Time,402340009.576,5   ???                                 0x0000000000000001 0x0 + 1


Oct  1 19:06:49 steve Parallels[142]: Starting Parallels networking...


Oct  1 19:06:50 steve Parallels[146]: Loading kernel extension  prl_netbridge.kext


Oct  1 19:06:52 steve rpcsvchost[148]: sandbox_init: com.apple.msrpc.netlogon.sb succeeded


Oct  1 19:06:52 steve Parallels[152]: Loading kernel extension  prl_vnic.kext


Oct  1 19:06:56 steve configd[16]: network configuration changed.


Oct  1 19:06:57 steve com.apple.SystemStarter[61]: objc[112]: Class SocketLibAsyncUnixStreamSocket is implemented in both /Library/Frameworks/MissingSyncWM.framework/Versions/A/MissingSyncWM and /Library/Application Support/Missing Sync for Windows Mobile/Missing Sync WM Monitor.app/Contents/SharedSupport/Missing Sync Listener.app/Contents/MacOS/Missing Sync Listener. One of the two will be used. Which one is undefined.


Oct  1 19:06:57 steve com.apple.SystemStarter[61]: objc[112]: Class SocketLibAsyncSocket is implemented in both /Library/Frameworks/MissingSyncWM.framework/Versions/A/MissingSyncWM and /Library/Application Support/Missing Sync for Windows Mobile/Missing Sync WM Monitor.app/Contents/SharedSupport/Missing Sync Listener.app/Contents/MacOS/Missing Sync Listener. One of the two will be used. Which one is undefined.


Oct  1 19:06:57 steve com.apple.SystemStarter[61]: objc[112]: Class SocketLibSyncSocket is implemented in both /Library/Frameworks/MissingSyncWM.framework/Versions/A/MissingSyncWM and /Library/Application Support/Missing Sync for Windows Mobile/Missing Sync WM Monitor.app/Contents/SharedSupport/Missing Sync Listener.app/Contents/MacOS/Missing Sync Listener. One of the two will be used. Which one is undefined.


Oct  1 19:06:57 steve com.apple.SystemStarter[61]: objc[112]: Class SocketLibUnixStreamListener is implemented in both /Library/Frameworks/MissingSyncWM.framework/Versions/A/MissingSyncWM and /Library/Application Support/Missing Sync for Windows Mobile/Missing Sync WM Monitor.app/Contents/SharedSupport/Missing Sync Listener.app/Contents/MacOS/Missing Sync Listener. One of the two will be used. Which one is undefined.


Oct  1 19:06:57 steve com.apple.SystemStarter[61]: objc[112]: Class SocketLibTCPListener is implemented in both /Library/Frameworks/MissingSyncWM.framework/Versions/A/MissingSyncWM and /Library/Application Support/Missing Sync for Windows Mobile/Missing Sync WM Monitor.app/Contents/SharedSupport/Missing Sync Listener.app/Contents/MacOS/Missing Sync Listener. One of the two will be used. Which one is undefined.


Oct  1 19:06:57 steve com.apple.SystemStarter[61]: objc[112]: Class SocketLibAsyncTCPSocket is implemented in both /Library/Frameworks/MissingSyncWM.framework/Versions/A/MissingSyncWM and /Library/Application Support/Missing Sync for Windows Mobile/Missing Sync WM Monitor.app/Contents/SharedSupport/Missing Sync Listener.app/Contents/MacOS/Missing Sync Listener. One of the two will be used. Which one is undefined.


Oct  1 19:06:57 steve Missing Sync Listener[112]: 3891612: (CGSLookupServerRootPort) Untrusted apps are not allowed to connect to or launch Window Server before login.


Oct  1 19:06:57 steve Missing Sync Listener[112]: kCGErrorRangeCheck: On-demand launch of the Window Server is allowed for root user only.


Oct  1 19:06:57 steve Missing Sync Listener[112]: kCGErrorFailure: Set a breakpoint @ CGErrorBreakpoint() to catch errors as they are logged.


Oct  1 19:06:57 steve Missing Sync Listener[112]: CGSLookupServerRootPort: Failed to look up the port for "com.apple.windowserver.active" (1102)


Oct  1 19:06:57 steve Missing Sync Listener[112]: kCGErrorRangeCheck: On-demand launch of the Window Server is allowed for root user only.


Oct  1 19:06:57 steve Missing Sync Listener[112]: CGSLookupServerRootPort: Failed to look up the port for "com.apple.windowserver.active" (1102)


Oct  1 19:06:57 steve ntpd[55]: proto: precision = 1.000 usec


Oct  1 19:06:59 steve SystemStarter[61]: The following StartupItems failed to start properly:


Oct  1 19:06:59 steve SystemStarter[61]: /Library/StartupItems/Privoxy


Oct  1 19:06:59 steve SystemStarter[61]:  - execution of Startup script failed


Oct  1 19:06:59 steve SystemStarter[61]: /Library/StartupItems/MediaServer


Oct  1 19:06:59 steve SystemStarter[61]:  - execution of Startup script failed


Oct  1 19:06:59 steve com.parallels.desktop.launchdaemon[90]: No suitable device found for PVS1.


Oct  1 19:07:00 steve TeamViewer_Service[89]: CGSLookupServerRootPort: Failed to look up the port for "com.apple.windowserver.active" (1102)


Oct  1 19:07:00: --- last message repeated 2 times ---


Oct  1 19:07:00 steve TeamViewer_Service[89]: 3891612: (CGSLookupServerRootPort) Untrusted apps are not allowed to connect to or launch Window Server before login.


Oct  1 19:07:00 steve TeamViewer_Service[89]: kCGErrorRangeCheck: On-demand launch of the Window Server is allowed for root user only.


Oct  1 19:07:00 steve TeamViewer_Service[89]: kCGErrorFailure: Set a breakpoint @ CGErrorBreakpoint() to catch errors as they are logged.


Oct  1 19:07:00 steve TeamViewer_Service[89]: CGSLookupServerRootPort: Failed to look up the port for "com.apple.windowserver.active" (1102)


Oct  1 19:07:00 steve TeamViewer_Service[89]: kCGErrorRangeCheck: On-demand launch of the Window Server is allowed for root user only.


Oct  1 19:07:00 steve TeamViewer_Service[89]: CGSLookupServerRootPort: Failed to look up the port for "com.apple.windowserver.active" (1102)


Oct  1 19:07:00 steve com.apple.SystemStarter[61]: _RegisterApplication(), FAILED TO establish the default connection to the WindowServer, _CGSDefaultConnection() is NULL.


Oct  1 19:07:00 steve Missing Sync Listener[112]: _RegisterApplication(), FAILED TO establish the default connection to the WindowServer, _CGSDefaultConnection() is NULL.


Oct  1 19:07:00 steve TeamViewer_Service[89]: _RegisterApplication(), FAILED TO establish the default connection to the WindowServer, _CGSDefaultConnection() is NULL.


Oct  1 19:07:00 steve com.teamviewer.service[89]: _RegisterApplication(), FAILED TO establish the default connection to the WindowServer, _CGSDefaultConnection() is NULL.


Oct  1 19:07:00 steve Missing Sync Listener[112]: CGSLookupServerRootPort: Failed to look up the port for "com.apple.windowserver.active" (1102)


Oct  1 19:07:00: --- last message repeated 2 times ---


Oct  1 19:07:00 steve com.parallels.desktop.launchdaemon[90]: objc[95]: Class QMacSoundDelegate is implemented in both /Library/Parallels/Parallels Service.app/Contents/MacOS/libQtGui.4.dylib and /usr/local/lib/libprl_sdk.dylib. One of the two will be used. Which one is undefined.


Oct  1 19:07:00 steve com.parallels.desktop.launchdaemon[90]: objc[95]: Class QNSMenu is implemented in both /Library/Parallels/Parallels Service.app/Contents/MacOS/libQtGui.4.dylib and /usr/local/lib/libprl_sdk.dylib. One of the two will be used. Which one is undefined.


Oct  1 19:07:00 steve com.parallels.desktop.launchdaemon[90]: objc[95]: Class QNSStatusItem is implemented in both /Library/Parallels/Parallels Service.app/Contents/MacOS/libQtGui.4.dylib and /usr/local/lib/libprl_sdk.dylib. One of the two will be used. Which one is undefined.


Oct  1 19:07:00 steve com.parallels.desktop.launchdaemon[90]: objc[95]: Class QNSImageView is implemented in both /Library/Parallels/Parallels Service.app/Contents/MacOS/libQtGui.4.dylib and /usr/local/lib/libprl_sdk.dylib. One of the two will be used. Which one is undefined.


Oct  1 19:07:01 steve prl_client_app[95]: CGSLookupServerRootPort: Failed to look up the port for "com.apple.windowserver.active" (1102)


Oct  1 19:07:01 steve XProtectUpdater[57]: Ignoring new signature plist: Not an increase in version


Oct  1 19:07:01 steve UserEventAgent[11]: CaptiveNetworkSupport:CaptivePublishState:1211 en1 - Probe


Oct  1 19:07:01 steve UserEventAgent[11]: CaptiveNetworkSupport:CNSPreferencesBuildSSIDLookup:278 ssidLookup:


Oct  1 19:07:01 steve UserEventAgent[11]:   <empty>


Oct  1 19:07:01 steve UserEventAgent[11]: CaptiveNetworkSupport:CaptiveStartDetect:2343 Bypassing probe on ESPAPPLE because it is protected and not on the exception list


Oct  1 19:07:01 steve UserEventAgent[11]: CaptiveNetworkSupport:CaptivePublishState:1211 en1 - Unknown


Oct  1 19:07:01 steve configd[16]: network configuration changed.


Oct  1 19:07:01 steve airportd[29]: _doAutoJoin: Already associated to “ESPAPPLEâ€. Bailing on auto-join.


Oct  1 19:07:01 steve Missing Sync Listener[112]: WARNING: The sun_len field of a sockaddr_un structure passed to CFSocketSetAddress was not set correctly using the SUN_LEN macro.


Oct  1 19:07:01 steve com.apple.SystemStarter[61]: 2013-10-01 19:07:01.692 Missing Sync Listener[112:b03] WARNING: The sun_len field of a sockaddr_un structure passed to CFSocketSetAddress was not set correctly using the SUN_LEN macro.


Oct  1 19:07:01 steve com.apple.launchd[1] (com.parallels.vm.prl_naptd): Unknown key for boolean: SuccessfulExit


Oct  1 19:07:01 steve UserEventAgent[11]: servermgr_certs[11] -[CertsRequestHandler(HelperAdditions) identitiesFromKeychain:]: SecItemCopyMatching (err = -25300)


Oct  1 19:07:01 steve com.apple.UserEventAgent-System[11]: SecItemCopyMatching: Impossibile trovare nel portachiavi l’elemento specificato.


Oct  1 19:07:01 steve UserEventAgent[11]: servermgr_certs[11] -[CertsRequestHandler(HelperAdditions) identitiesFromKeychain:]: SecItemCopyMatching (err = -25300)


Oct  1 19:07:01 steve UserEventAgent[11]: CertsKeychainMonitor: ready to process keychain & timer events


Oct  1 19:07:01 steve com.apple.UserEventAgent-System[11]: SecItemCopyMatching: Impossibile trovare nel portachiavi l’elemento specificato.


Oct  1 19:07:01 steve loginwindow[72]: **DMPROXY** Found `/System/Library/CoreServices/DMProxy'.


Oct  1 19:07:01 steve prl_naptd[178]: Starting Parallels Network Daemon


Oct  1 19:07:02 steve loginwindow[72]: 


O3REQUIRE FAILED: ret == 0


  - file: /SourceCache/BezelServices/BezelServices-232.3/Utilities/Utilities.c


  - line: 91


Oct  1 19:07:02 steve loginwindow[72]: Failed to lookup Bezel UI Server port: Bootstrap Unknown Service.


Oct  1 19:07:02 steve loginwindow[72]: Login Window Started Security Agent


Oct  1 19:07:02 steve prl_naptd[178]: en6: DHCP/NAT for 10.211.55.1-10.211.55.254 netmask 255.255.255.0


Oct  1 19:07:02 steve prl_naptd[178]: en7: DHCP for 10.37.129.1-10.37.129.254 netmask 255.255.255.0


Oct  1 19:07:02 steve com.apple.launchctl.LoginWindow[181]: com.apple.findmymacmessenger: Already loaded


Oct  1 19:07:02 steve airportd[29]: _doAutoJoin: Already associated to “ESPAPPLEâ€. Bailing on auto-join.


Oct  1 19:07:02 steve SecurityAgent[184]: Echo enabled


Oct  1 19:07:02 steve com.apple.launchd[1] (com.apple.xprotectupdater[57]): Exited with code: 252


Oct  1 19:07:02 steve com.parallels.desktop.launchdaemon[90]: Configuring en6...


Oct  1 19:07:02 steve com.parallels.desktop.launchdaemon[90]: No System Preferences changes required.


Oct  1 19:07:02 steve com.parallels.desktop.launchdaemon[90]: Configuring en7...


Oct  1 19:07:02 steve com.parallels.desktop.launchdaemon[90]: No System Preferences changes required.


Oct  1 19:07:02 steve Parallels[195]: Parallels networking sucessfully started


Oct  1 19:07:03 steve WindowServer[135]: kCGErrorFailure: Set a breakpoint @ CGErrorBreakpoint() to catch errors as they are logged.


Oct  1 19:07:03 steve Parallels[213]: Restarting CiscoVPN


Oct  1 19:07:03 steve SystemStarter[215]: Unknown service: CiscoVPN


Oct  1 19:07:03 steve Parallels[218]: Starting Parallels Dispatcher Service


Oct  1 19:07:03 steve fseventsd[17]: event logs in /Volumes/My Passport/.fseventsd out of sync with volume.  destroying old logs. (174 0 176097)


Oct  1 19:07:04 steve fseventsd[17]: log dir: /Volumes/My Passport/.fseventsd getting new uuid: AFD24588-6DE2-48C5-ABB7-E106E320D66F


Oct  1 19:07:04 steve fseventsd[17]: Events arrived for /Volumes/My Passport after an unmount request! Re-initializing.


Oct  1 19:07:04 steve fseventsd[17]: creating a dls for /Volumes/My Passport but it already has one...


Oct  1 19:07:05 steve mds[70]: (/.Spotlight-V100/Store-V2/0BD1B579-9F0F-49BA-AC78-BDECFE3262CD)(Error) IndexPath in openReverseStore:Successfully recovered from shadow with state d00d0dd0


Oct  1 19:08:06 steve SecurityAgent[184]: User info context values set for Steve


Oct  1 19:08:12: --- last message repeated 1 time ---


Oct  1 19:08:12 steve SecurityAgent[184]: Login Window login proceeding


Oct  1 19:08:12 steve loginwindow[72]: Login Window - Returned from Security Agent


Oct  1 19:08:12 steve loginwindow[72]: USER_PROCESS: 72 console


Oct  1 19:08:13 steve airportd[231]: _doAutoJoin: Already associated to “ESPAPPLEâ€. Bailing on auto-join.


Oct  1 19:08:13 steve com.apple.launchd.peruser.501[232] (com.apple.AirPortBaseStationAgent): Unknown value for key POSIXSpawnType: Background


Oct  1 19:08:13 steve com.apple.launchd.peruser.501[232] (com.apple.ReportCrash): Falling back to default Mach exception handler. Could not find: com.apple.ReportCrash.Self


Oct  1 19:08:13 steve com.apple.launchctl.Aqua[234]: load: option requires an argument -- D


Oct  1 19:08:13 steve com.apple.launchctl.Aqua[234]: usage: launchctl load [-wF] [-D <user|local|network|system|all>] paths...


Oct  1 19:08:13 steve com.apple.launchd.peruser.501[232] (com.apple.launchctl.Aqua[234]): Exited with code: 1


Oct  1 19:08:13 steve UserEventAgent[11]: CaptiveNetworkSupport:CNSServerRegisterUserAgent:187 new user agent port: 26151


Oct  1 19:08:15 steve fseventsd[17]: disk logger: failed to open output file /Volumes/My Passport/.fseventsd/000000000000066e (No such file or directory). mount point /Volumes/My Passport/.fseventsd


Oct  1 19:08:18: --- last message repeated 1 time ---


Oct  1 19:08:18 steve com.apple.dock.extra[273]: 2013-10-01 19:08:18.682 com.apple.dock.extra[273:1a07] Could not connect the action buttonPressed: to target of class NSApplication


Oct  1 19:08:18 steve com.apple.dock.extra[273]: 2013-10-01 19:08:18.718 com.apple.dock.extra[273:1a07] Could not connect the action buttonPressed: to target of class NSApplication


Oct  1 19:08:18: --- last message repeated 1 time ---


Oct  1 19:08:18 steve com.apple.dock.extra[273]: 2013-10-01 19:08:18.719 com.apple.dock.extra[273:1a07] Could not connect the action buttonPressed: to target of class NSApplication


Oct  1 19:08:18 steve com.apple.dock.extra[273]: Could not connect the action buttonPressed: to target of class NSApplication


Oct  1 19:08:24: --- last message repeated 3 times ---


Oct  1 19:08:24 steve [0x0-0xf00f].com.sketchup.SketchUp[248]: objc[248]: Object 0x4141ee0 of class __NSCFString autoreleased with no pool in place - just leaking - break on objc_autoreleaseNoPool() to debug


Oct  1 19:08:24 steve [0x0-0xf00f].com.sketchup.SketchUp[248]: objc[248]: Object 0x4142390 of class NSPathStore2 autoreleased with no pool in place - just leaking - break on objc_autoreleaseNoPool() to debug


Oct  1 19:08:24 steve [0x0-0xf00f].com.sketchup.SketchUp[248]: objc[248]: Object 0x41425a0 of class NSPathStore2 autoreleased with no pool in place - just leaking - break on objc_autoreleaseNoPool() to debug


Oct  1 19:08:25 steve Console[245]: Could not find image named 'BackArrow'.


Oct  1 19:08:25 steve Console[245]: Could not find image named 'ForwardArrow'.


Oct  1 19:08:26 steve SyncServer[289]: [0x109e16f60] |DataManager|Warning| Client com.apple.isyncDU.ipod.A27001BAFB8E8 image file path /System/Library/PrivateFrameworks/iPodSync.framework/Resources/ipod_4g.tiff does not exist.


Oct  1 19:08:26 steve SketchUp[248]: BugSplatFramework: initWithDatabase: defaultExceptionHandler is set


Oct  1 19:08:28 steve [0x0-0xf00f].com.sketchup.SketchUp[248]: Intrinsic Alchemy v3.5 Beta-1219 (Dynamic/Release)


Oct  1 19:08:28 steve [0x0-0xf00f].com.sketchup.SketchUp[248]: Built by pjackso2 on Wed Dec 19 00:00:00 2012


Oct  1 19:08:31 steve SketchUp[248]: SketchUp running in DEMO mode only.


Oct  1 19:08:31 steve SketchUp[248]: kCGErrorIllegalArgument: _CGSFindSharedWindow: WID 32


Oct  1 19:08:31 steve SketchUp[248]: kCGErrorFailure: Set a breakpoint @ CGErrorBreakpoint() to catch errors as they are logged.


Oct  1 19:08:31 steve SketchUp[248]: kCGErrorIllegalArgument: CGSRemoveSurface: Invalid window 0x20


Oct  1 19:08:32 steve com.parallels.desktop.client.launch[317]: objc[317]: Class QMacSoundDelegate is implemented in both /Library/Parallels/Parallels Service.app/Contents/MacOS/libQtGui.4.dylib and /usr/local/lib/libprl_sdk.dylib. One of the two will be used. Which one is undefined.


Oct  1 19:08:32 steve com.parallels.desktop.client.launch[317]: objc[317]: Class QNSMenu is implemented in both /Library/Parallels/Parallels Service.app/Contents/MacOS/libQtGui.4.dylib and /usr/local/lib/libprl_sdk.dylib. One of the two will be used. Which one is undefined.


Oct  1 19:08:32 steve com.parallels.desktop.client.launch[317]: objc[317]: Class QNSStatusItem is implemented in both /Library/Parallels/Parallels Service.app/Contents/MacOS/libQtGui.4.dylib and /usr/local/lib/libprl_sdk.dylib. One of the two will be used. Which one is undefined.


Oct  1 19:08:32 steve com.parallels.desktop.client.launch[317]: objc[317]: Class QNSImageView is implemented in both /Library/Parallels/Parallels Service.app/Contents/MacOS/libQtGui.4.dylib and /usr/local/lib/libprl_sdk.dylib. One of the two will be used. Which one is undefined.


Oct  1 19:08:32 steve com.apple.launchd.peruser.501[232] ([0x0-0x20020].com.apple.AirPortBaseStationAgent[326]): Exited with code: 1


Oct  1 19:08:33 steve com.apple.launchd.peruser.501[232] (com.apple.mrt.uiagent[309]): Exited with code: 255


Oct  1 19:08:33 steve Nikon Message Center 2[331]: LaunchType changed: (Unknown) to User


Oct  1 19:08:33 steve Nikon Message Center 2[331]: LaunchType changed: User to LoginItems


Oct  1 19:08:33 steve GoogleSoftwareUpdateDaemon[329]: -[KeystoneDaemon logServiceState] GoogleSoftwareUpdate daemon (1.1.0.3659) vending:


com.google.Keystone.Daemon.UpdateEngine: 2 connection(s)


com.google.Keystone.Daemon.Administration: 0 connection(s)


Oct  1 19:08:33 steve GoogleSoftwareUpdateDaemon[329]: -[KSUpdateEngine updateProductID:] KSUpdateEngine updating product ID: "com.google.Keystone"


Oct  1 19:08:34 steve GoogleSoftwareUpdateDaemon[329]: -[KSCheckAction performAction] KSCheckAction checking 1 ticket(s).


Oct  1 19:08:34 steve GoogleSoftwareUpdateDaemon[329]: -[KSUpdateCheckAction performAction] KSUpdateCheckAction starting update check for ticket(s): {(


<KSTicket:0x65d5c0


productID=com.google.Keystone


version=1.1.0.3659


xc=<KSPathExistenceChecker:0x658660 path=/Library/Google/GoogleSoftwareUpdate/GoogleSoftwareUpdate.bundle/>


serverType=Omaha


url=https://tools.google.com/service/update2


creationDate=2010-07-01 17:53:43


>


)}


Using server: <KSOmahaServer:0x264b90


engine=<KSDaemonUpdateEngine:0x25ec40>


params={


EngineVersion = "1.1.0.3659";


ActivesInfo = {


"com.google.picasa" = {


LastRollCallPingDate = 2013-09-29 07:00:02 +0000;


LastActivePingDate = 2010-07-08 07:00:00 +0000;


LastActiveDate = 2010-07-07 17:40:12 +0000;


};


"com.google.Keystone" = {


LastActivePingDate = 2013-09-29 07:00:02 +0000;


LastActiveDate = 2013-10-01 17:08:32 +0000;


LastRollCallPingDate = 2013-09-29 07:00:02 +0000;


};


"com.google.macphotouploader" = {


LastRollCallPingDate = 2013-09-29 07:00:01 +0000;


LastActivePingDate = 2012-04-06 07:00:00 +0000;


LastActiveDate = 2012-04-05 19:03:00 +0000;


};


"com.google.Chrome" = {


LastActiveDate = 2013-09-29 16:12:51 +0000;


LastActivePingDate = 2013-09-29 07:00:02 +0000;


LastRollCallPingDate = 2013-09-29 07:00:02 +0000;


};


"com.Google.GoogleEarthPlus.intel" = {


LastRollCallPingDate = 2013-09-29 07:00:02 +0000;


};


};


UserInitiated = 0;


IsSystem = 1;


OmahaOSVersion = "10.7.5_i486";


Identity = KeystoneDaemon;


AllowedSubdomains = (


".omaha.sandbox.google.com",


".tools.google.com",


".www.google.com",


".corp.google.com"


);


}


>


Oct  1 19:08:34 steve GoogleSoftwareUpdateDaemon[329]: -[KSUpdateCheckAction performAction] KSUpdateCheckAction running KSServerUpdateRequest: <KSOmahaServerUpdateRequest:0x6673a0


server=<KSOmahaServer:0x264b90>


url="https://tools.google.com/service/update2"


runningFetchers=0


tickets=1


activeTickets=1


rollCallTickets=1


body=


<?xml version="1.0" encoding="UTF-8" standalone="yes"?>


<o:gupdate xmlns:o="http://www.google.com/update2/request" protocol="2.0" version="KeystoneDaemon-1.1.0.3659" ismachine="1">


    <o:os platform="mac" version="MacOSX" sp="10.7.5_i486"></o:os>


    <o:app appid="com.google.Keystone" version="1.1.0.3659" lang="en-us" installage="1187" brand="GGLG">


        <o:ping r="2" a="2"></o:ping>


        <o:updatecheck></o:updatecheck>


    </o:app>


</o:gupdate>


>


Oct  1 19:08:34 steve Nikon Message Center 2[331]: activated with launch type[LoginItems]


Oct  1 19:08:34 steve Nikon Message Center 2[331]: not past connection period


Oct  1 19:08:34 steve Nikon Message Center 2[331]: terminate


Oct  1 19:08:35 steve UserEventAgent[235]: *** mach_port_mod_refs returned error 15


Oct  1 19:08:39 steve GoogleSoftwareUpdateDaemon[329]: -[KSUpdateCheckAction(KSServerUpdateRequestDelegate) serverRequest:fetchedWithResponse:] KSUpdateCheckAction received KSServerUpdateResponse: <KSOmahaServerUpdateResponse:0x65a840


server=<KSOmahaServer:0x264b90>


url="https://tools.google.com/service/update2"


status=200


tickets=1


activeTickets=1


rollCallTickets=1


data=


<?xml version="1.0" encoding="UTF-8" standalone="yes"?>


<gupdate xmlns="http://www.google.com/update2/response" protocol="2.0" server="prod">


    <daystart elapsed_seconds="36519"></daystart>


    <app appid="com.google.Keystone" status="ok">


        <ping status="ok"></ping>


        <updatecheck status="noupdate"></updatecheck>


    </app>


</gupdate>


>


Oct  1 19:08:39 steve talagent[250]: CGSConnectionRelinquishWindowRights(cid, newWindowNumber, reservedRights): CGError 1001 on line 619


Oct  1 19:08:39 steve GoogleSoftwareUpdateDaemon[329]: -[KSUpdateCheckAction(PrivateMethods) finishAction] KSUpdateCheckAction found updates: {( )}


Oct  1 19:08:39 steve talagent[250]: CGSReleaseWindow(cid, wid): CGError 1001 on line 759


Oct  1 19:08:39 steve GoogleSoftwareUpdateDaemon[329]: -[KSPrefetchAction performAction] KSPrefetchAction no updates to prefetch.


Oct  1 19:08:39 steve GoogleSoftwareUpdateDaemon[329]: -[KSMultiUpdateAction performAction] KSSilentUpdateAction had no updates to apply.


Oct  1 19:08:39 steve GoogleSoftwareUpdateDaemon[329]: -[KSMultiUpdateAction performAction] KSPromptAction had no updates to apply.


Oct  1 19:08:39 steve GoogleSoftwareUpdateDaemon[329]: -[KSUpdateEngine(PrivateMethods) updateFinish] KSUpdateEngine update processing complete.


Oct  1 19:08:39 steve GoogleSoftwareUpdateDaemon[329]: -[KSUpdateEngine updateAllProducts] KSUpdateEngine updating all installed products.


Oct  1 19:08:39 steve GoogleSoftwareUpdateDaemon[329]: -[KSCheckAction performAction] KSCheckAction checking 2 ticket(s).


Oct  1 19:08:40 steve GoogleSoftwareUpdateDaemon[329]: -[KSUpdateCheckAction performAction] KSUpdateCheckAction starting update check for ticket(s): {(


<KSTicket:0x661020


productID=com.google.macphotouploader


version=1.5.0.1425


xc=<KSLaunchServicesExistenceChecker:0x666400 bundle=com.google.macphotouploader>


url=https://tools.google.com/service/update2


creationDate=2009-01-05 09:08:32


>,


<KSTicket:0x65ea20


productID=com.google.Keystone


version=1.1.0.3659


xc=<KSPathExistenceChecker:0x666cf0 path=/Library/Google/GoogleSoftwareUpdate/GoogleSoftwareUpdate.bundle/>


serverType=Omaha


url=https://tools.google.com/service/update2


creationDate=2010-07-01 17:53:43


>


)}


Using server: <KSOmahaServer:0x26e090


engine=<KSDaemonUpdateEngine:0x25ec40>


params={


EngineVersion = "1.1.0.3659";


ActivesInfo = {


"com.google.picasa" = {


LastRollCallPingDate = 2013-09-29 07:00:02 +0000;


LastActivePingDate = 2010-07-08 07:00:00 +0000;


LastActiveDate = 2010-07-07 17:40:12 +0000;


};


"com.google.Keystone" = {


LastActivePingDate = 2013-10-01 07:00:00 +0000;


LastActiveDate = 2013-10-01 17:08:32 +0000;


LastRollCallPingDate = 2013-10-01 07:00:00 +0000;


};


"com.google.macphotouploader" = {


LastRollCallPingDate = 2013-09-29 07:00:01 +0000;


LastActivePingDate = 2012-04-06 07:00:00 +0000;


LastActiveDate = 2012-04-05 19:03:00 +0000;


};


"com.google.Chrome" = {


LastActiveDate = 2013-09-29 16:12:51 +0000;


LastActivePingDate = 2013-09-29 07:00:02 +0000;


LastRollCallPingDate = 2013-09-29 07:00:02 +0000;


};


"com.Google.GoogleEarthPlus.intel" = {


LastRollCallPingDate = 2013-09-29 07:00:02 +0000;


};


};


UserInitiated = 0;


IsSystem = 1;


OmahaOSVersion = "10.7.5_i486";


Identity = KeystoneDaemon;


AllowedSubdomains = (


".omaha.sandbox.google.com",


".tools.google.com",


".www.google.com",


".corp.google.com"


);


}


>


Oct  1 19:08:40 steve GoogleSoftwareUpdateDaemon[329]: -[KSUpdateCheckAction performAction] KSUpdateCheckAction running KSServerUpdateRequest: <KSOmahaServerUpdateRequest:0x26e6d0


server=<KSOmahaServer:0x26e090>


url="https://tools.google.com/service/update2"


runningFetchers=0


tickets=2


activeTickets=0


rollCallTickets=1


body=


<?xml version="1.0" encoding="UTF-8" standalone="yes"?>


<o:gupdate xmlns:o="http://www.google.com/update2/request" protocol="2.0" version="KeystoneDaemon-1.1.0.3659" ismachine="1">


    <o:os platform="mac" version="MacOSX" sp="10.7.5_i486"></o:os>


    <o:app appid="com.google.macphotouploader" version="1.5.0.1425" lang="en-us" installage="1730" brand="GGLG">


        <o:ping r="2"></o:ping>


        <o:updatecheck></o:updatecheck>


    </o:app>


    <o:app appid="com.google.Keystone" version="1.1.0.3659" lang="en-us" installage="1187" brand="GGLG">


        <o:updatecheck></o:updatecheck>


    </o:app>


</o:gupdate>


>



Oct  1 19:08:41 steve GoogleSoftwareUpdateDaemon[329]: -[KSUpdateCheckAction(KSServerUpdateRequestDelegate) serverRequest:fetchedWithResponse:] KSUpdateCheckAction received KSServerUpdateResponse: <KSOmahaServerUpdateResponse:0x26aef0


server=<KSOmahaServer:0x26e090>


url="https://tools.google.com/service/update2"


status=200


tickets=2


activeTickets=0


rollCallTickets=1


data=


<?xml version="1.0" encoding="UTF-8" standalone="yes"?>


<gupdate xmlns="http://www.google.com/update2/response" protocol="2.0" server="prod">


    <daystart elapsed_seconds="36521"></daystart>


    <app appid="com.google.macphotouploader" status="ok">


        <ping status="ok"></ping>


        <updatecheck status="noupdate"></updatecheck>


    </app>


    <app appid="com.google.Keystone" status="ok">


        <updatecheck status="noupdate"></updatecheck>


    </app>


</gupdate>


>


Oct  1 19:08:41 steve GoogleSoftwareUpdateDaemon[329]: -[KSUpdateCheckAction(PrivateMethods) finishAction] KSUpdateCheckAction found updates: {( )}


Oct  1 19:08:42 steve GoogleSoftwareUpdateDaemon[329]: -[KSPrefetchAction performAction] KSPrefetchAction no updates to prefetch.


Oct  1 19:08:42 steve GoogleSoftwareUpdateDaemon[329]: -[KSMultiUpdateAction performAction] KSSilentUpdateAction had no updates to apply.


Oct  1 19:08:42 steve GoogleSoftwareUpdateDaemon[329]: -[KSMultiUpdateAction performAction] KSPromptAction had no updates to apply.


Oct  1 19:08:42 steve GoogleSoftwareUpdateDaemon[329]: -[KSUpdateEngine(PrivateMethods) updateFinish] KSUpdateEngine update processing complete.


Oct  1 19:08:58 steve ubd[357]: can not configure ubd while in config only mode. forcing a restart


Oct  1 19:09:02 steve com.apple.Finder[252]: Dropbox: Entered INJECT_pthread_entry


Oct  1 19:09:02 steve com.apple.Finder[252]: Dropbox: Installing event loop timer


Oct  1 19:09:02 steve com.apple.Finder[252]: Dropbox: proc: 0x106626e62


Oct  1 19:09:02 steve com.apple.Finder[252]: Dropbox: upp: 0x106626e62


Oct  1 19:09:02 steve com.apple.Finder[252]: Dropbox: InstallEventLoopTimer: 0x7fff8f87c04e


Oct  1 19:09:02 steve com.apple.Finder[252]: Dropbox: GetMainEventLoop: 0x7fff8f83d749


Oct  1 19:09:02 steve com.apple.Finder[252]: Dropbox: timer installed!


Oct  1 19:09:02 steve com.apple.Finder[252]: Dropbox: Loading /Library/DropboxHelperTools/Dropbox_u501/DropboxBundle.bundle/Contents/MacOS/DropboxBundle


Oct  1 19:09:02 steve com.apple.Finder[252]: Dropbox: dlopen returned: 0x10643afd0


Oct  1 19:09:02 steve com.apple.Finder[252]: module initializer in main thread?: 1


Oct  1 19:09:33 steve KernelEventAgent[74]: tid 00000000 received event(s) VQ_LOWDISK, VQ_VERYLOWDISK (516)


Oct  1 19:09:33 steve mds[70]: (/)(Warning) IndexQuery in bool preIterate_FSI(SISearchCtx_FSI*):Throttling inefficient file system query


Oct  1 19:09:35 steve defaults[415]: 


The domain/default pair of (/Applications/Google Chrome.app/Contents/Info, KSBrandID) does not exist


Oct  1 19:09:38 steve com.apple.backupd[519]: Starting standard backup


Oct  1 19:09:38 steve com.apple.backupd[519]: Backing up to: /Volumes/My Passport/Backups.backupdb


Oct  1 19:09:44 steve com.apple.backupd[519]: Event store UUIDs don't match for volume: HD


Oct  1 19:09:47 steve com.apple.backupd[519]: Deep event scan at path:/ reason:must scan subdirs|new event db|


Oct  1 19:10:05 steve defaults[2672]: 


The domain/default pair of (/Applications/Google Chrome.app/Contents/Info, KSChannelID) does not exist


Oct  1 19:10:12 steve GoogleSoftwareUpdateDaemon[329]: -[KeystoneDaemon logServiceState] GoogleSoftwareUpdate daemon (1.1.0.3659) vending:


com.google.Keystone.Daemon.UpdateEngine: 1 connection(s)


com.google.Keystone.Daemon.Administration: 0 connection(s)


Oct  1 19:10:33 steve GoogleSoftwareUpdateDaemon[329]: -[KeystoneDaemon main] GoogleSoftwareUpdateDaemon inactive, shutdown.


Oct  1 19:11:51 steve helpd[311]: Could not find access page in directory /Applications/Final Cut Express HD.app/Contents/Resources/English.lproj/Final Cut Express Help


Oct  1 19:12:06: --- last message repeated 1 time ---


Oct  1 19:12:06 steve helpd[311]: CFPropertyListCreateFromXMLData(): Old-style plist parser: missing semicolon in dictionary.


Oct  1 19:12:36: --- last message repeated 1 time ---





Oct  1 19:23:44 steve AOSN[352]: XMPP session not connected - no ping sent



Oct  1 19:25:10 localhost bootlog[0]: BOOT_TIME 1380648310 0


Oct  1 19:25:28 localhost fseventsd[17]: event logs in /.fseventsd out of sync with volume.  destroying old logs. (1101 17 1148)


Oct  1 19:25:28 localhost fseventsd[17]: log dir: /.fseventsd getting new uuid: A418D999-4895-4A0A-9D32-8559FA7060BC


Oct  1 19:25:29 localhost UserEventAgent[11]: starting CaptiveNetworkSupport as SystemEventAgent built Jun 13 2011 17:29:21


Oct  1 19:25:14 localhost com.apple.launchd[1]: *** launchd[1] has started up. ***


Oct  1 19:25:28 localhost com.apple.launchd[1] (com.parallels.desktop.launchdaemon): Unknown key for boolean: HopefullyExitsFirst


Oct  1 19:25:28 localhost com.apple.launchd[1] (com.apple.powerd): Unknown value for key POSIXSpawnType: Interactive


Oct  1 19:25:28 localhost com.apple.launchd[1] (com.apple.sandboxd): Unknown value for key POSIXSpawnType: Interactive


Oct  1 19:25:29 localhost UserEventAgent[11]: WirelessAirPortDeviceNameCopy(): no BSD interface name found for object 12295


Oct  1 19:25:29 localhost UserEventAgent[11]: CaptiveNetworkSupport:CaptiveSCCopyWiFiDevices:388 WiFi Device Name == NULL


Oct  1 19:25:29 localhost UserEventAgent[11]: CertsKeychainMonitor: configuring


Oct  1 19:25:45 localhost mDNSResponder[12]: mDNSResponder mDNSResponder-320.16 (Jul 19 2012 21:07:07) starting OSXVers 11


Oct  1 19:25:48 localhost airportd[39]: _processDLILEvent: en1 attached (down)


Oct  1 19:25:50 localhost UserEventAgent[11]: CaptiveNetworkSupport:CreateInterfaceWatchList:2788 WiFi Devices Found. :)


Oct  1 19:25:50 localhost UserEventAgent[11]: CaptiveNetworkSupport:CaptivePublishState:1211 en1 - PreProbe


Oct  1 19:25:50 localhost UserEventAgent[11]: CaptiveNetworkSupport:CaptiveSCRebuildCache:81 Failed to get service order


Oct  1 19:25:53: --- last message repeated 1 time ---


Oct  1 19:25:50 localhost UserEventAgent[11]: CaptiveNetworkSupport:CaptivePublishState:1211 en1 - PreProbe


Oct  1 19:25:50 localhost UserEventAgent[11]: CaptiveNetworkSupport:CaptiveSCRebuildCache:81 Failed to get service order


Oct  1 19:25:53: --- last message repeated 1 time ---


Oct  1 19:25:50 localhost UserEventAgent[11]: CaptiveNetworkSupport:CaptivePublishState:1211 en1 - PreProbe


Oct  1 19:25:50 localhost configd[16]: network configuration changed.


Oct  1 19:25:50 steve configd[16]: setting hostname to "steve.local"


Oct  1 19:25:54 steve systemkeychain[32]: done file: /var/run/systemkeychaincheck.done


Oct  1 19:25:54 steve mDNSResponder[12]: D2D_IPC: Loaded


Oct  1 19:25:54 steve mDNSResponder[12]: D2DInitialize succeeded


Oct  1 19:25:54 steve configd[16]: network configuration changed.


Oct  1 19:25:54: --- last message repeated 1 time ---


Oct  1 19:25:54 steve com.apple.ucupdate.plist[61]: ucupdate: Checked 1 update, no match found.


Oct  1 19:25:54 steve com.apple.pfctl[69]: No ALTQ support in kernel


Oct  1 19:25:54 steve com.apple.pfctl[69]: ALTQ related functions disabled


Oct  1 19:25:54 steve com.apple.SystemStarter[62]: Starting up Missing Sync Listener


Oct  1 19:25:54 steve com.apple.SystemStarter[62]: Starting Asterisk PBX


Oct  1 19:25:54 steve Parallels[107]: Loading kernel extension  prl_hypervisor.kext


Oct  1 19:25:54 steve com.apple.SystemStarter[62]: Starting TwonkyMedia


Oct  1 19:25:54 steve com.apple.SystemStarter[62]: Starting Privoxy


Oct  1 19:25:54 steve com.apple.usbmuxd[60]: usbmuxd-296.4 on Dec 21 2012 at 16:11:14, running 64 bit


Oct  1 19:25:55 steve loginwindow[73]: Login Window Application Started


Oct  1 19:25:56 steve Parallels[124]: Loading kernel extension  prl_hid_hook.kext


Oct  1 19:25:57 steve UserEventAgent[11]: ServermgrdRegistration cannot load config data


Oct  1 19:25:58 steve Parallels[132]: Loading kernel extension  prl_usb_connect.kext


Oct  1 19:26:00 steve twonkymedia[116]: Launch of "/usr/local/mediaserver/twonkymedia" failed: the PowerPC architecture is no longer supported.


Oct  1 19:26:00 steve com.apple.SystemStarter[62]: 2013-10-01 19:26:00.494 RosettaNonGrata[116:12803] Launch of "/usr/local/mediaserver/twonkymedia" failed: the PowerPC architecture is no longer supported.


Oct  1 19:26:00 steve SystemStarter[62]: MediaServer (102) did not complete successfully


Oct  1 19:26:00 steve Parallels[139]: Trying to load kernel extensions, exit status: 0


Oct  1 19:26:01 steve netbiosd[134]: Unable to start NetBIOS name service: 


Oct  1 19:26:01 steve com.apple.locationd[74]: ERROR,Time,402341161.556,Function,"void CLDaemonCore::startRun()",locationd was started after an unclean shutdown


Oct  1 19:26:01 steve com.apple.locationd[74]: STACK,Time,402341161.556,1   locationd                           0x0000000101b00254 locationd + 176724


Oct  1 19:26:01 steve com.apple.locationd[74]: STACK,Time,402341161.556,2   locationd                           0x0000000101b011c6 locationd + 180678


Oct  1 19:26:01 steve com.apple.locationd[74]: STACK,Time,402341161.556,3   locationd                           0x0000000101b3232c locationd + 381740


Oct  1 19:26:01 steve com.apple.locationd[74]: STACK,Time,402341161.556,4   locationd                           0x0000000101ad6fd8 locationd + 8152


Oct  1 19:26:01 steve com.apple.locationd[74]: STACK,Time,402341161.556,5   ???                                 0x0000000000000001 0x0 + 1


Oct  1 19:26:01 steve mds[71]: (Normal) FMW: FMW 0 0


Oct  1 19:26:02 steve privoxy[117]: Launch of "./privoxy" failed: the PowerPC architecture is no longer supported.


Oct  1 19:26:02 steve com.apple.SystemStarter[62]: 2013-10-01 19:26:02.780 RosettaNonGrata[117:12803] Launch of "./privoxy" failed: the PowerPC architecture is no longer supported.


Oct  1 19:26:02 steve SystemStarter[62]: Privoxy (103) did not complete successfully


Oct  1 19:26:03 steve Parallels[143]: Starting Parallels networking...


Oct  1 19:26:04 steve com.apple.SystemStarter[62]: objc[109]: Class SocketLibAsyncUnixStreamSocket is implemented in both /Library/Frameworks/MissingSyncWM.framework/Versions/A/MissingSyncWM and /Library/Application Support/Missing Sync for Windows Mobile/Missing Sync WM Monitor.app/Contents/SharedSupport/Missing Sync Listener.app/Contents/MacOS/Missing Sync Listener. One of the two will be used. Which one is undefined.


Oct  1 19:26:04 steve com.apple.SystemStarter[62]: objc[109]: Class SocketLibAsyncSocket is implemented in both /Library/Frameworks/MissingSyncWM.framework/Versions/A/MissingSyncWM and /Library/Application Support/Missing Sync for Windows Mobile/Missing Sync WM Monitor.app/Contents/SharedSupport/Missing Sync Listener.app/Contents/MacOS/Missing Sync Listener. One of the two will be used. Which one is undefined.


Oct  1 19:26:04 steve com.apple.SystemStarter[62]: objc[109]: Class SocketLibSyncSocket is implemented in both /Library/Frameworks/MissingSyncWM.framework/Versions/A/MissingSyncWM and /Library/Application Support/Missing Sync for Windows Mobile/Missing Sync WM Monitor.app/Contents/SharedSupport/Missing Sync Listener.app/Contents/MacOS/Missing Sync Listener. One of the two will be used. Which one is undefined.


Oct  1 19:26:04 steve com.apple.SystemStarter[62]: objc[109]: Class SocketLibUnixStreamListener is implemented in both /Library/Frameworks/MissingSyncWM.framework/Versions/A/MissingSyncWM and /Library/Application Support/Missing Sync for Windows Mobile/Missing Sync WM Monitor.app/Contents/SharedSupport/Missing Sync Listener.app/Contents/MacOS/Missing Sync Listener. One of the two will be used. Which one is undefined.


Oct  1 19:26:04 steve com.apple.SystemStarter[62]: objc[109]: Class SocketLibTCPListener is implemented in both /Library/Frameworks/MissingSyncWM.framework/Versions/A/MissingSyncWM and /Library/Application Support/Missing Sync for Windows Mobile/Missing Sync WM Monitor.app/Contents/SharedSupport/Missing Sync Listener.app/Contents/MacOS/Missing Sync Listener. One of the two will be used. Which one is undefined.


Oct  1 19:26:04 steve com.apple.SystemStarter[62]: objc[109]: Class SocketLibAsyncTCPSocket is implemented in both /Library/Frameworks/MissingSyncWM.framework/Versions/A/MissingSyncWM and /Library/Application Support/Missing Sync for Windows Mobile/Missing Sync WM Monitor.app/Contents/SharedSupport/Missing Sync Listener.app/Contents/MacOS/Missing Sync Listener. One of the two will be used. Which one is undefined.


Oct  1 19:26:04 steve Missing Sync Listener[109]: 3891612: (CGSLookupServerRootPort) Untrusted apps are not allowed to connect to or launch Window Server before login.


Oct  1 19:26:04 steve Missing Sync Listener[109]: kCGErrorRangeCheck: On-demand launch of the Window Server is allowed for root user only.


Oct  1 19:26:04 steve Missing Sync Listener[109]: kCGErrorFailure: Set a breakpoint @ CGErrorBreakpoint() to catch errors as they are logged.


Oct  1 19:26:04 steve Missing Sync Listener[109]: CGSLookupServerRootPort: Failed to look up the port for "com.apple.windowserver.active" (1102)


Oct  1 19:26:04 steve Missing Sync Listener[109]: kCGErrorRangeCheck: On-demand launch of the Window Server is allowed for root user only.


Oct  1 19:26:04 steve Missing Sync Listener[109]: CGSLookupServerRootPort: Failed to look up the port for "com.apple.windowserver.active" (1102)


Oct  1 19:26:04 steve Parallels[147]: Loading kernel extension  prl_netbridge.kext


Oct  1 19:26:05 steve configd[16]: network configuration changed.


Oct  1 19:26:05 steve UserEventAgent[11]: CaptiveNetworkSupport:CaptivePublishState:1211 en1 - Probe


Oct  1 19:26:05 steve UserEventAgent[11]: CaptiveNetworkSupport:CNSPreferencesBuildSSIDLookup:278 ssidLookup:


Oct  1 19:26:05 steve UserEventAgent[11]:   <empty>


Oct  1 19:26:05 steve UserEventAgent[11]: CaptiveNetworkSupport:CaptiveStartDetect:2343 Bypassing probe on ESPAPPLE because it is protected and not on the exception list


Oct  1 19:26:05 steve UserEventAgent[11]: CaptiveNetworkSupport:CaptivePublishState:1211 en1 - Unknown


Oct  1 19:26:05 steve configd[16]: network configuration changed.


Oct  1 19:26:07 steve ntpd[56]: proto: precision = 1.000 usec


Oct  1 19:26:07 steve XProtectUpdater[58]: Ignoring new signature plist: Not an increase in version


Oct  1 19:26:07 steve com.apple.launchd[1] (com.apple.xprotectupdater[58]): Exited with code: 252


Oct  1 19:26:07 steve rpcsvchost[154]: sandbox_init: com.apple.msrpc.netlogon.sb succeeded


Oct  1 19:26:07 steve SystemStarter[62]: The following StartupItems failed to start properly:


Oct  1 19:26:07 steve SystemStarter[62]: /Library/StartupItems/MediaServer


Oct  1 19:26:07 steve SystemStarter[62]:  - execution of Startup script failed


Oct  1 19:26:07 steve SystemStarter[62]: /Library/StartupItems/Privoxy


Oct  1 19:26:07 steve SystemStarter[62]:  - execution of Startup script failed


Oct  1 19:26:08 steve Missing Sync Listener[109]: _RegisterApplication(), FAILED TO establish the default connection to the WindowServer, _CGSDefaultConnection() is NULL.


Oct  1 19:26:08 steve com.apple.SystemStarter[62]: _RegisterApplication(), FAILED TO establish the default connection to the WindowServer, _CGSDefaultConnection() is NULL.


Oct  1 19:26:08 steve Missing Sync Listener[109]: CGSLookupServerRootPort: Failed to look up the port for "com.apple.windowserver.active" (1102)


Oct  1 19:26:10: --- last message repeated 2 times ---


Oct  1 19:26:08 steve com.parallels.desktop.launchdaemon[91]: objc[95]: Class QMacSoundDelegate is implemented in both /Library/Parallels/Parallels Service.app/Contents/MacOS/libQtGui.4.dylib and /usr/local/lib/libprl_sdk.dylib. One of the two will be used. Which one is undefined.


Oct  1 19:26:08 steve com.parallels.desktop.launchdaemon[91]: objc[95]: Class QNSMenu is implemented in both /Library/Parallels/Parallels Service.app/Contents/MacOS/libQtGui.4.dylib and /usr/local/lib/libprl_sdk.dylib. One of the two will be used. Which one is undefined.


Oct  1 19:26:08 steve com.parallels.desktop.launchdaemon[91]: objc[95]: Class QNSStatusItem is implemented in both /Library/Parallels/Parallels Service.app/Contents/MacOS/libQtGui.4.dylib and /usr/local/lib/libprl_sdk.dylib. One of the two will be used. Which one is undefined.


Oct  1 19:26:08 steve com.parallels.desktop.launchdaemon[91]: objc[95]: Class QNSImageView is implemented in both /Library/Parallels/Parallels Service.app/Contents/MacOS/libQtGui.4.dylib and /usr/local/lib/libprl_sdk.dylib. One of the two will be used. Which one is undefined.


Oct  1 19:26:08 steve Parallels[165]: Loading kernel extension  prl_vnic.kext


Oct  1 19:26:09 steve prl_client_app[95]: CGSLookupServerRootPort: Failed to look up the port for "com.apple.windowserver.active" (1102)


Oct  1 19:26:09 steve com.parallels.desktop.launchdaemon[91]: No suitable device found for PVS1.


Oct  1 19:26:09 steve airportd[39]: _doAutoJoin: Already associated to “ESPAPPLEâ€. Bailing on auto-join.


Oct  1 19:26:09 steve TeamViewer_Service[90]: CGSLookupServerRootPort: Failed to look up the port for "com.apple.windowserver.active" (1102)


Oct  1 19:26:10: --- last message repeated 2 times ---


Oct  1 19:26:09 steve TeamViewer_Service[90]: 3891612: (CGSLookupServerRootPort) Untrusted apps are not allowed to connect to or launch Window Server before login.


Oct  1 19:26:09 steve TeamViewer_Service[90]: kCGErrorRangeCheck: On-demand launch of the Window Server is allowed for root user only.


Oct  1 19:26:09 steve TeamViewer_Service[90]: kCGErrorFailure: Set a breakpoint @ CGErrorBreakpoint() to catch errors as they are logged.


Oct  1 19:26:09 steve TeamViewer_Service[90]: CGSLookupServerRootPort: Failed to look up the port for "com.apple.windowserver.active" (1102)


Oct  1 19:26:09 steve TeamViewer_Service[90]: kCGErrorRangeCheck: On-demand launch of the Window Server is allowed for root user only.


Oct  1 19:26:09 steve TeamViewer_Service[90]: CGSLookupServerRootPort: Failed to look up the port for "com.apple.windowserver.active" (1102)


Oct  1 19:26:09 steve TeamViewer_Service[90]: _RegisterApplication(), FAILED TO establish the default connection to the WindowServer, _CGSDefaultConnection() is NULL.


Oct  1 19:26:09 steve com.teamviewer.service[90]: _RegisterApplication(), FAILED TO establish the default connection to the WindowServer, _CGSDefaultConnection() is NULL.


Oct  1 19:26:10 steve Missing Sync Listener[109]: WARNING: The sun_len field of a sockaddr_un structure passed to CFSocketSetAddress was not set correctly using the SUN_LEN macro.


Oct  1 19:26:10 steve com.apple.SystemStarter[62]: 2013-10-01 19:26:10.146 Missing Sync Listener[109:b03] WARNING: The sun_len field of a sockaddr_un structure passed to CFSocketSetAddress was not set correctly using the SUN_LEN macro.


Oct  1 19:26:10 steve mds[71]: (/.Spotlight-V100/Store-V2/0BD1B579-9F0F-49BA-AC78-BDECFE3262CD)(Error) IndexPath in openReverseStore:Successfully recovered from shadow with state d00d0dd0


Oct  1 19:26:10 steve loginwindow[73]: **DMPROXY** Found `/System/Library/CoreServices/DMProxy'.


Oct  1 19:26:10 steve loginwindow[73]: 


O3REQUIRE FAILED: ret == 0


  - file: /SourceCache/BezelServices/BezelServices-232.3/Utilities/Utilities.c


  - line: 91


Oct  1 19:26:10 steve loginwindow[73]: Failed to lookup Bezel UI Server port: Bootstrap Unknown Service.


Oct  1 19:26:10 steve loginwindow[73]: Login Window Started Security Agent


Oct  1 19:26:10 steve com.apple.launchctl.LoginWindow[173]: com.apple.findmymacmessenger: Already loaded


Oct  1 19:26:11 steve airportd[39]: _doAutoJoin: Already associated to “ESPAPPLEâ€. Bailing on auto-join.


Oct  1 19:26:11 steve SecurityAgent[176]: Echo enabled


Oct  1 19:26:11 steve com.apple.launchd[1] (com.parallels.vm.prl_naptd): Unknown key for boolean: SuccessfulExit


Oct  1 19:26:11 steve prl_naptd[192]: Starting Parallels Network Daemon


Oct  1 19:26:11 steve prl_naptd[192]: en6: DHCP/NAT for 10.211.55.1-10.211.55.254 netmask 255.255.255.0


Oct  1 19:26:11 steve prl_naptd[192]: en7: DHCP for 10.37.129.1-10.37.129.254 netmask 255.255.255.0


Oct  1 19:26:12 steve WindowServer[119]: kCGErrorFailure: Set a breakpoint @ CGErrorBreakpoint() to catch errors as they are logged.


Oct  1 19:26:12 steve com.parallels.desktop.launchdaemon[91]: Configuring en6...


Oct  1 19:26:12 steve com.parallels.desktop.launchdaemon[91]: No System Preferences changes required.


Oct  1 19:26:12 steve com.parallels.desktop.launchdaemon[91]: Configuring en7...


Oct  1 19:26:12 steve com.parallels.desktop.launchdaemon[91]: No System Preferences changes required.


Oct  1 19:26:12 steve Parallels[210]: Parallels networking sucessfully started


Oct  1 19:26:12 steve fseventsd[17]: event logs in /Volumes/My Passport/.fseventsd out of sync with volume.  destroying old logs. (373 0 1148)


Oct  1 19:26:12 steve fseventsd[17]: log dir: /Volumes/My Passport/.fseventsd getting new uuid: AFD24588-6DE2-48C5-ABB7-E106E320D66F


Oct  1 19:26:12 steve fseventsd[17]: Events arrived for /Volumes/My Passport after an unmount request! Re-initializing.


Oct  1 19:26:12 steve fseventsd[17]: creating a dls for /Volumes/My Passport but it already has one...


Oct  1 19:26:13 steve Parallels[216]: Restarting CiscoVPN


Oct  1 19:26:13 steve SystemStarter[218]: Unknown service: CiscoVPN


Oct  1 19:26:13 steve Parallels[221]: Starting Parallels Dispatcher Service


Oct  1 19:26:24 steve UserEventAgent[11]: servermgr_certs[11] -[CertsRequestHandler(HelperAdditions) identitiesFromKeychain:]: SecItemCopyMatching (err = -25300)


Oct  1 19:26:24 steve com.apple.UserEventAgent-System[11]: SecItemCopyMatching: Impossibile trovare nel portachiavi l’elemento specificato.


Oct  1 19:26:24 steve UserEventAgent[11]: servermgr_certs[11] -[CertsRequestHandler(HelperAdditions) identitiesFromKeychain:]: SecItemCopyMatching (err = -25300)


Oct  1 19:26:24 steve com.apple.UserEventAgent-System[11]: SecItemCopyMatching: Impossibile trovare nel portachiavi l’elemento specificato.


Oct  1 19:26:24 steve UserEventAgent[11]: CertsKeychainMonitor: ready to process keychain & timer events


Oct  1 19:26:37 steve SecurityAgent[176]: User info context values set for Steve


Oct  1 19:26:48: --- last message repeated 1 time ---


Oct  1 19:26:48 steve SecurityAgent[176]: Login Window login proceeding


Oct  1 19:26:49 steve loginwindow[73]: Login Window - Returned from Security Agent


Oct  1 19:26:49 steve loginwindow[73]: USER_PROCESS: 73 console


Oct  1 19:26:49 steve airportd[229]: _doAutoJoin: Already associated to “ESPAPPLEâ€. Bailing on auto-join.


Oct  1 19:26:49 steve com.apple.launchd.peruser.501[230] (com.apple.AirPortBaseStationAgent): Unknown value for key POSIXSpawnType: Background


Oct  1 19:26:49 steve com.apple.launchd.peruser.501[230] (com.apple.ReportCrash): Falling back to default Mach exception handler. Could not find: com.apple.ReportCrash.Self


Oct  1 19:26:49 steve com.apple.launchctl.Aqua[232]: load: option requires an argument -- D


Oct  1 19:26:49 steve com.apple.launchctl.Aqua[232]: usage: launchctl load [-wF] [-D <user|local|network|system|all>] paths...


Oct  1 19:26:49 steve com.apple.launchd.peruser.501[230] (com.apple.launchctl.Aqua[232]): Exited with code: 1


Oct  1 19:26:50 steve UserEventAgent[11]: CaptiveNetworkSupport:CNSServerRegisterUserAgent:187 new user agent port: 14351


Oct  1 19:26:51 steve fseventsd[17]: disk logger: failed to open output file /Volumes/My Passport/.fseventsd/00000000000006b3 (No such file or directory). mount point /Volumes/My Passport/.fseventsd


Oct  1 19:26:52: --- last message repeated 1 time ---


Oct  1 19:26:52 steve com.apple.dock.extra[271]: Could not connect the action buttonPressed: to target of class NSApplication


Oct  1 19:26:52 steve com.apple.dock.extra[271]: 2013-10-01 19:26:52.956 com.apple.dock.extra[271:1a07] Could not connect the action buttonPressed: to target of class NSApplication


Oct  1 19:26:52 steve com.apple.dock.extra[271]: Could not connect the action buttonPressed: to target of class NSApplication


Oct  1 19:26:52 steve com.apple.dock.extra[271]: 2013-10-01 19:26:52.958 com.apple.dock.extra[271:1a07] Could not connect the action buttonPressed: to target of class NSApplication


Oct  1 19:26:52 steve com.apple.dock.extra[271]: Could not connect the action buttonPressed: to target of class NSApplication


Oct  1 19:26:52: --- last message repeated 1 time ---


Oct  1 19:26:52 steve com.apple.dock.extra[271]: 2013-10-01 19:26:52.960 com.apple.dock.extra[271:1a07] Could not connect the action buttonPressed: to target of class NSApplication


Oct  1 19:26:52 steve com.apple.dock.extra[271]: 2013-10-01 19:26:52.967 com.apple.dock.extra[271:1a07] Could not connect the action buttonPressed: to target of class NSApplication


Oct  1 19:26:54 steve Console[244]: Could not find image named 'BackArrow'.


Oct  1 19:26:54 steve Console[244]: Could not find image named 'ForwardArrow'.


Oct  1 19:26:55 steve SyncServer[281]: [0x108c16f60] |DataManager|Warning| Client com.apple.isyncDU.ipod.A27001BAFB8E8 image file path /System/Library/PrivateFrameworks/iPodSync.framework/Resources/ipod_4g.tiff does not exist.


Oct  1 19:26:56 steve [0x0-0xe00e].com.sketchup.SketchUp[245]: objc[245]: Object 0x41966c0 of class __NSCFString autoreleased with no pool in place - just leaking - break on objc_autoreleaseNoPool() to debug


Oct  1 19:26:56 steve [0x0-0xe00e].com.sketchup.SketchUp[245]: objc[245]: Object 0x4196b70 of class NSPathStore2 autoreleased with no pool in place - just leaking - break on objc_autoreleaseNoPool() to debug


Oct  1 19:26:56 steve [0x0-0xe00e].com.sketchup.SketchUp[245]: objc[245]: Object 0x4196d80 of class NSPathStore2 autoreleased with no pool in place - just leaking - break on objc_autoreleaseNoPool() to debug


Oct  1 19:26:56 steve SketchUp[245]: BugSplatFramework: initWithDatabase: defaultExceptionHandler is set


Oct  1 19:26:57 steve [0x0-0xe00e].com.sketchup.SketchUp[245]: Intrinsic Alchemy v3.5 Beta-1219 (Dynamic/Release)


Oct  1 19:26:57 steve [0x0-0xe00e].com.sketchup.SketchUp[245]: Built by pjackso2 on Wed Dec 19 00:00:00 2012


Oct  1 19:26:59 steve SketchUp[245]: SketchUp running in DEMO mode only.


Oct  1 19:26:59 steve SketchUp[245]: kCGErrorIllegalArgument: _CGSFindSharedWindow: WID 31


Oct  1 19:26:59 steve SketchUp[245]: kCGErrorFailure: Set a breakpoint @ CGErrorBreakpoint() to catch errors as they are logged.


Oct  1 19:26:59 steve SketchUp[245]: kCGErrorIllegalArgument: CGSRemoveSurface: Invalid window 0x1f


Oct  1 19:26:59 steve com.apple.launchd.peruser.501[230] ([0x0-0x1c01c].com.apple.AirPortBaseStationAgent[310]): Exited with code: 1


Oct  1 19:27:00 steve com.apple.launchd.peruser.501[230] (com.apple.mrt.uiagent[294]): Exited with code: 255


Oct  1 19:27:00 steve Nikon Message Center 2[313]: LaunchType changed: (Unknown) to User


Oct  1 19:27:00 steve Nikon Message Center 2[313]: LaunchType changed: User to LoginItems


Oct  1 19:27:00 steve com.parallels.desktop.client.launch[302]: objc[302]: Class QMacSoundDelegate is implemented in both /Library/Parallels/Parallels Service.app/Contents/MacOS/libQtGui.4.dylib and /usr/local/lib/libprl_sdk.dylib. One of the two will be used. Which one is undefined.


Oct  1 19:27:00 steve com.parallels.desktop.client.launch[302]: objc[302]: Class QNSMenu is implemented in both /Library/Parallels/Parallels Service.app/Contents/MacOS/libQtGui.4.dylib and /usr/local/lib/libprl_sdk.dylib. One of the two will be used. Which one is undefined.


Oct  1 19:27:00 steve com.parallels.desktop.client.launch[302]: objc[302]: Class QNSStatusItem is implemented in both /Library/Parallels/Parallels Service.app/Contents/MacOS/libQtGui.4.dylib and /usr/local/lib/libprl_sdk.dylib. One of the two will be used. Which one is undefined.


Oct  1 19:27:00 steve com.parallels.desktop.client.launch[302]: objc[302]: Class QNSImageView is implemented in both /Library/Parallels/Parallels Service.app/Contents/MacOS/libQtGui.4.dylib and /usr/local/lib/libprl_sdk.dylib. One of the two will be used. Which one is undefined.


Oct  1 19:27:01 steve Nikon Message Center 2[313]: activated with launch type[LoginItems]


Oct  1 19:27:01 steve Nikon Message Center 2[313]: not past connection period


Oct  1 19:27:01 steve Nikon Message Center 2[313]: terminate


Oct  1 19:27:02 steve UserEventAgent[233]: *** mach_port_mod_refs returned error 15


Oct  1 19:27:07: --- last message repeated 1 time ---


Oct  1 19:27:07 steve talagent[247]: CGSConnectionRelinquishWindowRights(cid, newWindowNumber, reservedRights): CGError 1001 on line 619


Oct  1 19:27:07 steve talagent[247]: CGSReleaseWindow(cid, wid): CGError 1001 on line 759



Oct  1 19:27:20 steve com.apple.Finder[249]: Dropbox: Entered INJECT_pthread_entry


Oct  1 19:27:20 steve com.apple.Finder[249]: Dropbox: Installing event loop timer


Oct  1 19:27:20 steve com.apple.Finder[249]: Dropbox: proc: 0x1068f0e62


Oct  1 19:27:20 steve com.apple.Finder[249]: Dropbox: upp: 0x1068f0e62


Oct  1 19:27:20 steve com.apple.Finder[249]: Dropbox: InstallEventLoopTimer: 0x7fff8f87c04e


Oct  1 19:27:20 steve com.apple.Finder[249]: Dropbox: GetMainEventLoop: 0x7fff8f83d749


Oct  1 19:27:20 steve com.apple.Finder[249]: Dropbox: Loading /Library/DropboxHelperTools/Dropbox_u501/DropboxBundle.bundle/Contents/MacOS/DropboxBundle


Oct  1 19:27:20 steve com.apple.Finder[249]: Dropbox: timer installed!


Oct  1 19:27:20 steve com.apple.Finder[249]: Dropbox: dlopen returned: 0x7fb991268950


Oct  1 19:27:20 steve com.apple.Finder[249]: module initializer in main thread?: 1


Oct  1 19:27:27 steve ubd[344]: can not configure ubd while in config only mode. forcing a restart

Share this post


Link to post
Share on other sites

Create an account or sign in to comment

You need to be a member in order to leave a comment

Create an account

Sign up for a new account in our community. It's easy!

Register a new account

Sign in

Already have an account? Sign in here.

Sign In Now