Sign in to follow this  
smaikol

problemi xcode

Recommended Posts

Ciao a tutti forum!

Intanto un augurio di Buon Natale!

Vengo al dunque.

Ho installato xcode (diverse volte a dire la verità) Tutto ok nell'installazione. Sembra funzionare tutto, ma quando vado a fare delle compilazioni di alcuni software spesso mi da un errore facendo il make.

ld: can't locate file for: -ldylib1.o

/usr/bin/libtool: internal link edit command failed

make[2]: *** [libusb.la] Error 1

make[1]: *** [all-recursive] Error 1

make: *** [all] Error 2

girando in rete tra forum e altro sembra che la soluzione sia reinstallare xcode. ma anche se lo faccio, ho panther 10.3.9, pb 12" ppc 1Ghz 512 mb ram, torno sempre al punto di prima anche installando i pckg uno alla volta a manina da riga di comando.

soluzioni? idee? suggerimenti?

Grazie a tutti!

smaikol

Share this post


Link to post
Share on other sites

Create an account or sign in to comment

You need to be a member in order to leave a comment

Create an account

Sign up for a new account in our community. It's easy!

Register a new account

Sign in

Already have an account? Sign in here.

Sign In Now
Sign in to follow this